Info

IUTLibmodemLteNone, LibmodemLtemNbiot, LteNone, WiFi_7002DK, ble_mesh_model, ble_mesh_samples, ble_samples_newlib, crypto_all, dtm, fmn, gateway_only, headset_only, nfc, nrf5340audio_mono, nrf5340audio_stereo, nrf_provisioning, rpc, thingy91
Filter(not applied)
Report Created13/08/2025 22:06:12, 93fea165b10b (Linux #15~24.04.1-Ubuntu SMP Thu May 1 02:52:08 UTC 2025, CPython 3.12.4)
CTFctf-BaseTestAdapter 0.21.0, ctf-ConfigurationManager 0.30.1, ctf-DeviceAdminAdapter 1.33.0, ctf-DeviceAdminAdapterInternal 1.33.0, ctf-EbqAdapter 0.3.0, ctf-IOAdapter 2.13.4, ctf-NfcAdapter 1.5.19, ctf-PowerAnalyzerAdapter 0.9.4, ctf-PowerSwitchAdapter 0.2.1, ctf-ProductRobustnessAdapter 0.4.0, ctf-ProductTestManager 0.12.0, ctf-TargetCommunicationAdapter 2.42.0, ctf-TestManager 1.39.0, ctf-TestReferenceAdapter 0.10.2, ctf-Tools 0.11.0
Repositoryhttps://projecttools.nordicsemi.no/bitbucket/scm/ncs-test/test-fw-nrfconnect-nrf.git
Branchv3.1-branch
Commitdb891b8baa43d1ceeaacf25d0794fe90e96d7f51
2025-08-04 13:27:50+02:00
Piotr, piotr.radzik@nordicsemi.no
revert: 'west: quarantine test-fw-nrfconnect-apps'

Additional Info

IUTLibmodemLteNone
Filter(test_suite_id=*TraceBackend* or *CallbacksSample* or *PDN* or *Ciphersuites*) -a test_suite_id=*9160*
Report Created13/08/2025 21:36:24, f21d4d419fef (Linux #63-Ubuntu SMP PREEMPT_DYNAMIC Tue Apr 15 19:04:15 UTC 2025, CPython 3.12.3)
CTFctf-BaseTestAdapter 0.23.0, ctf-ConfigurationManager 0.30.1, ctf-DeviceAdminAdapter 1.38.0, ctf-DeviceAdminAdapterInternal 1.38.0, ctf-EbqAdapter 0.3.0, ctf-IOAdapter 2.14.0, ctf-NfcAdapter 1.5.20, ctf-PowerAnalyzerAdapter 0.9.4, ctf-PowerSwitchAdapter 0.2.1, ctf-ProductRobustnessAdapter 0.4.0, ctf-ProductTestManager 0.12.0, ctf-TargetCommunicationAdapter 2.44.0, ctf-TestManager 1.42.0, ctf-TestReferenceAdapter 0.10.2, ctf-Tools 0.11.0
Repositoryhttps://projecttools.nordicsemi.no/bitbucket/scm/ncs-test/test-fw-nrfconnect-nrf_iot.git
Branchdetached
Commitd36b2f0b32f698804a525dd21f8aadd6c3ff60be
2025-05-07 07:53:54+02:00
Jorgen Kvalvaag, jorgen.kvalvaag@nordicsemi.no
thingy91: Update CONTENTS.txt files in release zips
IUTLibmodemLteNone
Filter(test_suite_id=*TraceBackend* or *CallbacksSample* or *PDN* or *Ciphersuites*) -a test_suite_id=*9161*
Report Created13/08/2025 21:36:24, 75d7f0bd1326 (Linux #63-Ubuntu SMP PREEMPT_DYNAMIC Tue Apr 15 19:04:15 UTC 2025, CPython 3.12.3)
CTFctf-BaseTestAdapter 0.23.0, ctf-ConfigurationManager 0.30.1, ctf-DeviceAdminAdapter 1.38.0, ctf-DeviceAdminAdapterInternal 1.38.0, ctf-EbqAdapter 0.3.0, ctf-IOAdapter 2.14.0, ctf-NfcAdapter 1.5.20, ctf-PowerAnalyzerAdapter 0.9.4, ctf-PowerSwitchAdapter 0.2.1, ctf-ProductRobustnessAdapter 0.4.0, ctf-ProductTestManager 0.12.0, ctf-TargetCommunicationAdapter 2.44.0, ctf-TestManager 1.42.0, ctf-TestReferenceAdapter 0.10.2, ctf-Tools 0.11.0
Repositoryhttps://projecttools.nordicsemi.no/bitbucket/scm/ncs-test/test-fw-nrfconnect-nrf_iot.git
Branchdetached
Commitd36b2f0b32f698804a525dd21f8aadd6c3ff60be
2025-05-07 07:53:54+02:00
Jorgen Kvalvaag, jorgen.kvalvaag@nordicsemi.no
thingy91: Update CONTENTS.txt files in release zips
IUTLibmodemLteNone, LibmodemLtemNbiot
Filter(test_suite_id=*IPOffload*_ltem_* or *MdmKeyMgmt* or *LibmodemOffload* or *TestLibmodemInitShutdownOffload*) -a test_suite_id=*9160*
Report Created13/08/2025 21:36:04, e5ced93edd7b (Linux #63-Ubuntu SMP PREEMPT_DYNAMIC Tue Apr 15 19:04:15 UTC 2025, CPython 3.12.3)
CTFctf-BaseTestAdapter 0.23.0, ctf-ConfigurationManager 0.30.1, ctf-DeviceAdminAdapter 1.38.0, ctf-DeviceAdminAdapterInternal 1.38.0, ctf-EbqAdapter 0.3.0, ctf-IOAdapter 2.14.0, ctf-NfcAdapter 1.5.20, ctf-PowerAnalyzerAdapter 0.9.4, ctf-PowerSwitchAdapter 0.2.1, ctf-ProductRobustnessAdapter 0.4.0, ctf-ProductTestManager 0.12.0, ctf-TargetCommunicationAdapter 2.44.0, ctf-TestManager 1.42.0, ctf-TestReferenceAdapter 0.10.2, ctf-Tools 0.11.0
Repositoryhttps://projecttools.nordicsemi.no/bitbucket/scm/ncs-test/test-fw-nrfconnect-nrf_iot.git
Branchdetached
Commitd36b2f0b32f698804a525dd21f8aadd6c3ff60be
2025-05-07 07:53:54+02:00
Jorgen Kvalvaag, jorgen.kvalvaag@nordicsemi.no
thingy91: Update CONTENTS.txt files in release zips
IUTLteNone
Filtertest_case_tags=CLOUD_INTEGRATION -a test_case_tags=CLOUD_FOTA
Report Created13/08/2025 21:23:37, e540220ce0f8 (Linux #57-Ubuntu SMP PREEMPT_DYNAMIC Wed Feb 12 23:42:21 UTC 2025, CPython 3.12.4)
CTFctf-BaseTestAdapter 0.19.0, ctf-ConfigurationManager 0.30.1, ctf-DeviceAdminAdapter 1.30.1, ctf-DeviceAdminAdapterInternal 1.30.1, ctf-EbqAdapter 0.3.0, ctf-IOAdapter 2.13.2, ctf-NfcAdapter 1.5.17, ctf-PowerAnalyzerAdapter 0.9.4, ctf-PowerSwitchAdapter 0.2.1, ctf-ProductRobustnessAdapter 0.4.0, ctf-ProductTestManager 0.11.0, ctf-TargetCommunicationAdapter 2.40.1, ctf-TestManager 1.39.0, ctf-TestReferenceAdapter 0.10.2, ctf-Tools 0.11.0
Repositoryhttps://projecttools.nordicsemi.no/bitbucket/scm/ncs-test/test-fw-nrfconnect-nrf_iot.git
BranchDetached HEAD
Commitd36b2f0b32f698804a525dd21f8aadd6c3ff60be
2025-05-07 07:53:54+02:00
Jorgen Kvalvaag, jorgen.kvalvaag@nordicsemi.no
thingy91: Update CONTENTS.txt files in release zips
IUTLteNone
Filtertest_case_tags=CLOUD_INTEGRATION -n test_case_tags=CLOUD_FOTA
Report Created13/08/2025 21:26:16, 3c03195acb7d (Linux #57-Ubuntu SMP PREEMPT_DYNAMIC Wed Feb 12 23:42:21 UTC 2025, CPython 3.12.4)
CTFctf-BaseTestAdapter 0.19.0, ctf-ConfigurationManager 0.30.1, ctf-DeviceAdminAdapter 1.30.1, ctf-DeviceAdminAdapterInternal 1.30.1, ctf-EbqAdapter 0.3.0, ctf-IOAdapter 2.13.2, ctf-NfcAdapter 1.5.17, ctf-PowerAnalyzerAdapter 0.9.4, ctf-PowerSwitchAdapter 0.2.1, ctf-ProductRobustnessAdapter 0.4.0, ctf-ProductTestManager 0.11.0, ctf-TargetCommunicationAdapter 2.40.1, ctf-TestManager 1.39.0, ctf-TestReferenceAdapter 0.10.2, ctf-Tools 0.11.0
Repositoryhttps://projecttools.nordicsemi.no/bitbucket/scm/ncs-test/test-fw-nrfconnect-nrf_iot.git
BranchDetached HEAD
Commitd36b2f0b32f698804a525dd21f8aadd6c3ff60be
2025-05-07 07:53:54+02:00
Jorgen Kvalvaag, jorgen.kvalvaag@nordicsemi.no
thingy91: Update CONTENTS.txt files in release zips
IUTWiFi_7002DK
Filtertest_case_id test_wifi_radio_* test_suite_id WiFi_7002DK_RadioTest*ASUS_RTAX88U*
Report Created13/08/2025 21:46:44, 8db319788316 (Linux #65-Ubuntu SMP PREEMPT_DYNAMIC Mon May 19 17:15:03 UTC 2025, CPython 3.12.4)
CTFctf-BaseTestAdapter 0.24.0, ctf-ConfigurationManager 0.30.1, ctf-DeviceAdminAdapter 1.39.0, ctf-DeviceAdminAdapterInternal 1.39.0, ctf-EbqAdapter 0.3.0, ctf-IOAdapter 2.14.0, ctf-NfcAdapter 1.5.20, ctf-PowerAnalyzerAdapter 0.9.7, ctf-PowerSwitchAdapter 0.2.1, ctf-ProductRobustnessAdapter 0.4.0, ctf-ProductTestManager 0.12.0, ctf-TargetCommunicationAdapter 2.45.0, ctf-TestManager 1.42.0, ctf-TestReferenceAdapter 0.10.2, ctf-Tools 0.11.0
Repositoryssh://git@bitbucket.nordicsemi.no:7999/ncs-test/test-sdk-wifi.git
Branchdetached
Commitf954db783693f3d8c82c98b3241c533c4bb75360
2025-08-13 11:13:58+02:00
Saini, Vijendra, vijendra.saini@nordicsemi.no
Pull request #2706: Master
IUTWiFi_7002DK
Filtertest_suite_id WiFi_7002DK_ShellSample__wpa3sae*ASUS_RTAX88U* test_case_id test_connect*11ax20*
Report Created13/08/2025 21:29:00, 3bc06ee1a1ae (Linux #58-Ubuntu SMP PREEMPT_DYNAMIC Fri Feb 14 15:33:28 UTC 2025, CPython 3.12.4)
CTFctf-BaseTestAdapter 0.24.0, ctf-ConfigurationManager 0.30.1, ctf-DeviceAdminAdapter 1.39.0, ctf-DeviceAdminAdapterInternal 1.39.0, ctf-EbqAdapter 0.3.0, ctf-IOAdapter 2.14.0, ctf-NfcAdapter 1.5.20, ctf-PowerAnalyzerAdapter 0.9.7, ctf-PowerSwitchAdapter 0.2.1, ctf-ProductRobustnessAdapter 0.4.0, ctf-ProductTestManager 0.12.0, ctf-TargetCommunicationAdapter 2.45.0, ctf-TestManager 1.42.0, ctf-TestReferenceAdapter 0.10.2, ctf-Tools 0.11.0
Repositoryssh://git@bitbucket.nordicsemi.no:7999/ncs-test/test-sdk-wifi.git
Branchdetached
Commitf954db783693f3d8c82c98b3241c533c4bb75360
2025-08-13 11:13:58+02:00
Saini, Vijendra, vijendra.saini@nordicsemi.no
Pull request #2706: Master
IUTWiFi_7002DK
Filtertest_suite_id WiFi_7002DK_TxInjectionSampleTest*11ax20*wpa2psk*ASUS_RTAX88U* test_case_id test_wifi_tx_injection_sample
Report Created13/08/2025 21:28:20, 30080de4a1f5 (Linux #26~24.04.1-Ubuntu SMP PREEMPT_DYNAMIC Thu Apr 17 19:20:47 UTC 2, CPython 3.12.4)
CTFctf-BaseTestAdapter 0.24.0, ctf-ConfigurationManager 0.30.1, ctf-DeviceAdminAdapter 1.39.0, ctf-DeviceAdminAdapterInternal 1.39.0, ctf-EbqAdapter 0.3.0, ctf-IOAdapter 2.14.0, ctf-NfcAdapter 1.5.20, ctf-PowerAnalyzerAdapter 0.9.7, ctf-PowerSwitchAdapter 0.2.1, ctf-ProductRobustnessAdapter 0.4.0, ctf-ProductTestManager 0.12.0, ctf-TargetCommunicationAdapter 2.45.0, ctf-TestManager 1.42.0, ctf-TestReferenceAdapter 0.10.2, ctf-Tools 0.11.0
Repositoryssh://git@bitbucket.nordicsemi.no:7999/ncs-test/test-sdk-wifi.git
Branchdetached
Commitf954db783693f3d8c82c98b3241c533c4bb75360
2025-08-13 11:13:58+02:00
Saini, Vijendra, vijendra.saini@nordicsemi.no
Pull request #2706: Master
IUTWiFi_7002DK
Filtertest_case_id test_scan_sample test_suite_id WiFi_7002DK_ScanSampleTest*ASUS_RTAX88U*
Report Created13/08/2025 21:24:54, ab7a2389bc4d (Linux #58-Ubuntu SMP PREEMPT_DYNAMIC Fri Feb 14 15:33:28 UTC 2025, CPython 3.12.4)
CTFctf-BaseTestAdapter 0.24.0, ctf-ConfigurationManager 0.30.1, ctf-DeviceAdminAdapter 1.39.0, ctf-DeviceAdminAdapterInternal 1.39.0, ctf-EbqAdapter 0.3.0, ctf-IOAdapter 2.14.0, ctf-NfcAdapter 1.5.20, ctf-PowerAnalyzerAdapter 0.9.7, ctf-PowerSwitchAdapter 0.2.1, ctf-ProductRobustnessAdapter 0.4.0, ctf-ProductTestManager 0.12.0, ctf-TargetCommunicationAdapter 2.45.0, ctf-TestManager 1.42.0, ctf-TestReferenceAdapter 0.10.2, ctf-Tools 0.11.0
Repositoryssh://git@bitbucket.nordicsemi.no:7999/ncs-test/test-sdk-wifi.git
Branchdetached
Commitf954db783693f3d8c82c98b3241c533c4bb75360
2025-08-13 11:13:58+02:00
Saini, Vijendra, vijendra.saini@nordicsemi.no
Pull request #2706: Master
IUTble_mesh_model, ble_mesh_samples
Filtertest_case_tags=integration iut=ble_mesh*
Report Created13/08/2025 21:45:09, 83699f3bdc66 (Linux #52-Ubuntu SMP PREEMPT_DYNAMIC Thu Dec 5 13:09:44 UTC 2024, CPython 3.12.4)
CTFctf-BaseTestAdapter 0.22.0, ctf-ConfigurationManager 0.30.1, ctf-DeviceAdminAdapter 1.37.0, ctf-DeviceAdminAdapterInternal 1.37.0, ctf-EbqAdapter 0.3.0, ctf-IOAdapter 2.14.0, ctf-NfcAdapter 1.5.20, ctf-PowerAnalyzerAdapter 0.9.4, ctf-PowerSwitchAdapter 0.2.1, ctf-ProductRobustnessAdapter 0.4.0, ctf-ProductTestManager 0.12.0, ctf-TargetCommunicationAdapter 2.44.0, ctf-TestManager 1.42.0, ctf-TestReferenceAdapter 0.10.2, ctf-Tools 0.11.0
Repositoryssh://git@bitbucket.nordicsemi.no:7999/ncs-test/test-sdk-mesh.git
Branchdetached
Commit6d5c44c086136622f6a896200615e7c72bf13d82
2025-08-07 09:28:39+02:00
Khromykh, Aleksandr, aleksandr.khromykh@nordicsemi.no
Pull request #176: NCSDK-0000: update docker image version
IUTble_samples_newlib, dtm
Filtertest_cycle=oncommit dut.dev.attr_shortname=52840r3 or 5340 or 54l15app or 54h20fp1 or 54lm20a_dk -n dut.libs.attr_id=pcft -n dut.dev.attr_shortname=52bsim -n test_suite_id=*BabbleSim* -n iut=lite_samples -n attr_cfg_component_id=*llvm* -n dut.comp.attr_id=clang -n testers.comp.attr_id=clang -n dut.dev.attr_shortname=52833f iut=dtm or ble_samples_newlib
Report Created13/08/2025 21:39:56, d96488482f00 (Linux #52-Ubuntu SMP PREEMPT_DYNAMIC Thu Dec 5 13:09:44 UTC 2024, CPython 3.12.4)
CTFctf-BaseTestAdapter 0.24.0, ctf-ConfigurationManager 0.30.1, ctf-DeviceAdminAdapter 1.41.0, ctf-DeviceAdminAdapterInternal 1.41.0, ctf-EbqAdapter 0.3.0, ctf-IOAdapter 2.14.0, ctf-NfcAdapter 1.5.20, ctf-PowerAnalyzerAdapter 0.9.7, ctf-PowerSwitchAdapter 0.2.1, ctf-ProductRobustnessAdapter 0.4.0, ctf-ProductTestManager 0.12.0, ctf-TargetCommunicationAdapter 2.45.0, ctf-TestManager 1.42.0, ctf-TestReferenceAdapter 0.10.2, ctf-Tools 0.11.0
Repositoryhttps://projecttools.nordicsemi.no/bitbucket/scm/ncs-test/test-sdk-ble-samples.git
Branchv3.1-branch
Commit07c54b20464d869a6b8b4240320bb035026af88c
2025-08-04 12:57:58+02:00
Sebastian Wezel, sebastian.wezel@nordicsemi.no
NCSDK-1234: NCS release v3.1.0
IUTcrypto_all
Filter(dut.libs.attr_id=cc3xx_oberon -o dut.libs.attr_id=cc3xx_legacy -o dut.libs.attr_id=cracen) -a (dut.dev.attr_zephyr_board=nrf5340dk*nrf5340*cpuapp -o dut.dev.attr_zephyr_board=nrf5340dk*nrf5340*cpuapp*ns -o dut.dev.attr_zephyr_board=nrf54l15dk*nrf54l15*cpuapp -o dut.dev.attr_zephyr_board=nrf54l15dk*nrf54l15*cpuapp*ns) -a (test_suite_id=*TestDtls* -o test_suite_id=*TestTls*)
Report Created13/08/2025 21:35:53, 93996f12bf02 (Linux #60-Ubuntu SMP PREEMPT_DYNAMIC Fri Mar 14 18:29:48 UTC 2025, CPython 3.12.4)
CTFctf-BaseTestAdapter 0.24.0, ctf-ConfigurationManager 0.30.1, ctf-DeviceAdminAdapter 1.39.0, ctf-DeviceAdminAdapterInternal 1.39.0, ctf-EbqAdapter 0.3.0, ctf-IOAdapter 2.14.0, ctf-NfcAdapter 1.5.20, ctf-PowerAnalyzerAdapter 0.9.7, ctf-PowerSwitchAdapter 0.2.1, ctf-ProductRobustnessAdapter 0.4.0, ctf-ProductTestManager 0.12.0, ctf-TargetCommunicationAdapter 2.45.0, ctf-TestManager 1.42.0, ctf-TestReferenceAdapter 0.10.2, ctf-Tools 0.11.0
Repositoryhttps://projecttools.nordicsemi.no/bitbucket/scm/ncs-test/test-fw-nrfconnect-nrf_crypto.git
BranchDetached HEAD
Commit82d799ebd6b635d3ea0845e1fd3f172e2c1c322d
2025-08-04 12:58:03+02:00
Sebastian Wezel, sebastian.wezel@nordicsemi.no
NCSDK-1234: NCS release v3.1.0
IUTfmn
Filter-n (dut.dev.attr_shortname=5340app)
Report Created13/08/2025 21:27:42, 4e46a5221d76 (Linux #57-Ubuntu SMP PREEMPT_DYNAMIC Wed Feb 12 23:42:21 UTC 2025, CPython 3.12.4)
CTFctf-BaseTestAdapter 0.24.0, ctf-ConfigurationManager 0.30.1, ctf-DeviceAdminAdapter 1.41.0, ctf-DeviceAdminAdapterInternal 1.41.0, ctf-EbqAdapter 0.3.0, ctf-IOAdapter 2.14.0, ctf-NfcAdapter 1.5.20, ctf-PowerAnalyzerAdapter 0.9.7, ctf-PowerSwitchAdapter 0.2.1, ctf-ProductRobustnessAdapter 0.4.0, ctf-ProductTestManager 0.12.0, ctf-TargetCommunicationAdapter 2.45.0, ctf-TestManager 1.42.0, ctf-TestReferenceAdapter 0.10.2, ctf-Tools 0.11.0
Repositoryhttps://projecttools.nordicsemi.no/bitbucket/scm/ncs-test/test-sdk-find-my.git
Branchv3.1-branch
Commit035bda8781cea159a920622cc9e379a1a7c48966
2025-08-04 12:58:08+02:00
Sebastian Wezel, sebastian.wezel@nordicsemi.no
NCSDK-1234: NCS release v3.1.0
IUTgateway_only, headset_only, nrf5340audio_mono, nrf5340audio_stereo
Filter((((test_cycle=oncommit) -a ((test_suite_id=*FuncMonoSmoketest_digi_h1_fwd_bis_debug* -a test_case_id=test_audio_rms_level) -o test_case_id=test_volume_control_short) -o test_suite_id=*_only_Build*_digi_ret_cis_debug* or *_only_Build*_anlg_fwd_cis_debug*) -a ( -n (test_suite_id=*IsoTestApp* -o attr_cfg_component_id=*5340dk_gw*) -n (test_suite_id=nrf5340audio_mono_FuncMonoGeneral_digi_h1_ret_cis* -a test_case_id=test_play_pause)) ) -a attr_cfg_component_id=*_sdc*) -a ((test_cycle=oncommit -n (test_suite_id=*FuncSmoketests_debug_5340adk_tgt_none* or *ret* or *dual_gateway* or *fwd_usb8k* or *fwd_usb16k* or *anlg*)) -o test_suite_id=*Build*) -n (test_suite_id=*dfu*)
Report Created13/08/2025 21:20:00, node-test-138 (Windows 10.0.19045, CPython 3.12.3)
CTFctf-ConfigurationManager 0.31.0, ctf-DeviceAdminAdapter 1.38.0, ctf-IOAdapter 2.14.0, ctf-PowerAnalyzerAdapter 0.9.5, ctf-ProductTestManager 0.13.0, ctf-TargetCommunicationAdapter 2.44.0, ctf-TestManager 1.42.0, ctf-TestReferenceAdapter 0.10.2
Repositoryhttps://projecttools.nordicsemi.no/bitbucket/scm/ncs-test/test-sdk-audio.git
Branchv3.1-branch
Commit3e3735e229a83040c66bd03478490c7a30392f55
2025-08-04 12:57:56+02:00
Sebastian Wezel, sebastian.wezel@nordicsemi.no
NCSDK-1234: NCS release v3.1.0
IUTnfc
Filter(not applied)
Report Created13/08/2025 21:32:53, b8238241291a (Linux #59-Ubuntu SMP PREEMPT_DYNAMIC Sat Mar 15 17:40:59 UTC 2025, CPython 3.12.4)
CTFctf-BaseTestAdapter 0.24.0, ctf-ConfigurationManager 0.30.1, ctf-DeviceAdminAdapter 1.38.0, ctf-DeviceAdminAdapterInternal 1.38.0, ctf-EbqAdapter 0.3.0, ctf-IOAdapter 2.14.0, ctf-NfcAdapter 1.5.20, ctf-PowerAnalyzerAdapter 0.9.7, ctf-PowerSwitchAdapter 0.2.1, ctf-ProductRobustnessAdapter 0.4.0, ctf-ProductTestManager 0.12.0, ctf-TargetCommunicationAdapter 2.44.0, ctf-TestManager 1.42.0, ctf-TestReferenceAdapter 0.10.2, ctf-Tools 0.11.0
Repositoryhttps://projecttools.nordicsemi.no/bitbucket/scm/ncs-test/test-fw-nrfconnect-nfc.git
Branchv3.1-branch
Commitda34cc51891fa557ae0e4535878cd5d0cb1889c7
2025-08-04 12:57:59+02:00
Sebastian Wezel, sebastian.wezel@nordicsemi.no
NCSDK-1234: NCS release v3.1.0
IUTnrf_provisioning
Filtertest_suite_id=*Lwm2mClientIntegration* or *TestLwm2mOuluIntegration* or *TestZephyrLwm2mClientOverlays*
Report Created13/08/2025 21:23:10, 828f544a7ddf (Linux #57-Ubuntu SMP PREEMPT_DYNAMIC Wed Feb 12 23:42:21 UTC 2025, CPython 3.12.4)
CTFctf-BaseTestAdapter 0.23.0, ctf-ConfigurationManager 0.30.1, ctf-DeviceAdminAdapter 1.38.0, ctf-DeviceAdminAdapterInternal 1.38.0, ctf-EbqAdapter 0.3.0, ctf-IOAdapter 2.14.0, ctf-NfcAdapter 1.5.20, ctf-PowerAnalyzerAdapter 0.9.4, ctf-PowerSwitchAdapter 0.2.1, ctf-ProductRobustnessAdapter 0.4.0, ctf-ProductTestManager 0.12.0, ctf-TargetCommunicationAdapter 2.44.0, ctf-TestManager 1.42.0, ctf-TestReferenceAdapter 0.10.2, ctf-Tools 0.11.0
Repositoryhttps://projecttools.nordicsemi.no/bitbucket/scm/ncs-test/test-fw-nrfconnect-nrf_iot.git
BranchDetached HEAD
Commitd36b2f0b32f698804a525dd21f8aadd6c3ff60be
2025-05-07 07:53:54+02:00
Jorgen Kvalvaag, jorgen.kvalvaag@nordicsemi.no
thingy91: Update CONTENTS.txt files in release zips
IUTnrf_provisioning
Filtertest_case_tags=SLM_INTEGRATION
Report Created13/08/2025 21:23:00, 0f4ed52ea746 (Linux #63-Ubuntu SMP PREEMPT_DYNAMIC Tue Apr 15 19:04:15 UTC 2025, CPython 3.12.4)
CTFctf-BaseTestAdapter 0.23.0, ctf-ConfigurationManager 0.30.1, ctf-DeviceAdminAdapter 1.38.0, ctf-DeviceAdminAdapterInternal 1.38.0, ctf-EbqAdapter 0.3.0, ctf-IOAdapter 2.14.0, ctf-NfcAdapter 1.5.20, ctf-PowerAnalyzerAdapter 0.9.4, ctf-PowerSwitchAdapter 0.2.1, ctf-ProductRobustnessAdapter 0.4.0, ctf-ProductTestManager 0.12.0, ctf-TargetCommunicationAdapter 2.44.0, ctf-TestManager 1.42.0, ctf-TestReferenceAdapter 0.10.2, ctf-Tools 0.11.0
Repositoryhttps://projecttools.nordicsemi.no/bitbucket/scm/ncs-test/test-fw-nrfconnect-nrf_iot.git
BranchDetached HEAD
Commitd36b2f0b32f698804a525dd21f8aadd6c3ff60be
2025-05-07 07:53:54+02:00
Jorgen Kvalvaag, jorgen.kvalvaag@nordicsemi.no
thingy91: Update CONTENTS.txt files in release zips
IUTnrf_provisioning
Filtertest_case_tags=SLM_INTEGRATION
Report Created13/08/2025 21:23:15, df60b360d2ec (Linux #63-Ubuntu SMP PREEMPT_DYNAMIC Tue Apr 15 19:04:15 UTC 2025, CPython 3.12.4)
CTFctf-BaseTestAdapter 0.23.0, ctf-ConfigurationManager 0.30.1, ctf-DeviceAdminAdapter 1.38.0, ctf-DeviceAdminAdapterInternal 1.38.0, ctf-EbqAdapter 0.3.0, ctf-IOAdapter 2.14.0, ctf-NfcAdapter 1.5.20, ctf-PowerAnalyzerAdapter 0.9.4, ctf-PowerSwitchAdapter 0.2.1, ctf-ProductRobustnessAdapter 0.4.0, ctf-ProductTestManager 0.12.0, ctf-TargetCommunicationAdapter 2.44.0, ctf-TestManager 1.42.0, ctf-TestReferenceAdapter 0.10.2, ctf-Tools 0.11.0
Repositoryhttps://projecttools.nordicsemi.no/bitbucket/scm/ncs-test/test-fw-nrfconnect-nrf_iot.git
BranchDetached HEAD
Commitd36b2f0b32f698804a525dd21f8aadd6c3ff60be
2025-05-07 07:53:54+02:00
Jorgen Kvalvaag, jorgen.kvalvaag@nordicsemi.no
thingy91: Update CONTENTS.txt files in release zips
IUTnrf_provisioning
Filtertest_suite_id=*Lwm2mClientIntegration* or *TestLwm2mOuluIntegration* or *TestZephyrLwm2mClientOverlays*
Report Created13/08/2025 21:21:31, 0f9e63ffc34b (Linux #63-Ubuntu SMP PREEMPT_DYNAMIC Tue Apr 15 19:04:15 UTC 2025, CPython 3.12.4)
CTFctf-BaseTestAdapter 0.23.0, ctf-ConfigurationManager 0.30.1, ctf-DeviceAdminAdapter 1.38.0, ctf-DeviceAdminAdapterInternal 1.38.0, ctf-EbqAdapter 0.3.0, ctf-IOAdapter 2.14.0, ctf-NfcAdapter 1.5.20, ctf-PowerAnalyzerAdapter 0.9.4, ctf-PowerSwitchAdapter 0.2.1, ctf-ProductRobustnessAdapter 0.4.0, ctf-ProductTestManager 0.12.0, ctf-TargetCommunicationAdapter 2.44.0, ctf-TestManager 1.42.0, ctf-TestReferenceAdapter 0.10.2, ctf-Tools 0.11.0
Repositoryhttps://projecttools.nordicsemi.no/bitbucket/scm/ncs-test/test-fw-nrfconnect-nrf_iot.git
BranchDetached HEAD
Commitd36b2f0b32f698804a525dd21f8aadd6c3ff60be
2025-05-07 07:53:54+02:00
Jorgen Kvalvaag, jorgen.kvalvaag@nordicsemi.no
thingy91: Update CONTENTS.txt files in release zips
IUTrpc
Filtertest_cycle=oncommit
Report Created13/08/2025 21:20:47, 093e4cc36b87 (Linux #59-Ubuntu SMP PREEMPT_DYNAMIC Sat Mar 15 17:40:59 UTC 2025, CPython 3.12.4)
CTFctf-BaseTestAdapter 0.23.0, ctf-ConfigurationManager 0.30.1, ctf-DeviceAdminAdapter 1.38.0, ctf-DeviceAdminAdapterInternal 1.38.0, ctf-EbqAdapter 0.3.0, ctf-IOAdapter 2.14.0, ctf-NfcAdapter 1.5.20, ctf-PowerAnalyzerAdapter 0.9.4, ctf-PowerSwitchAdapter 0.2.1, ctf-ProductRobustnessAdapter 0.4.0, ctf-ProductTestManager 0.12.0, ctf-TargetCommunicationAdapter 2.44.0, ctf-TestManager 1.42.0, ctf-TestReferenceAdapter 0.10.2, ctf-Tools 0.11.0
Repositoryhttps://projecttools.nordicsemi.no/bitbucket/scm/ncs-test/test-fw-nrfconnect-rpc.git
Branchv3.1-branch
Commit34f8b103edc1e7dec4213dc5fd03018aff4cbced
2025-08-04 12:58:04+02:00
Sebastian Wezel, sebastian.wezel@nordicsemi.no
NCSDK-1234: NCS release v3.1.0
IUTthingy91
Filtertest_group=thingy_integration
Report Created13/08/2025 21:32:58, node-test-05.nordicsemi.no (Linux #57-Ubuntu SMP PREEMPT_DYNAMIC Wed Feb 12 23:42:21 UTC 2025, CPython 3.12.4)
CTFctf-BaseTestAdapter 0.24.0, ctf-ConfigurationManager 0.30.1, ctf-DeviceAdminAdapter 1.38.0, ctf-DeviceAdminAdapterInternal 1.38.0, ctf-EbqAdapter 0.3.0, ctf-IOAdapter 2.14.0, ctf-NfcAdapter 1.5.20, ctf-PowerAnalyzerAdapter 0.9.7, ctf-PowerSwitchAdapter 0.2.1, ctf-ProductRobustnessAdapter 0.4.0, ctf-ProductTestManager 0.12.0, ctf-TargetCommunicationAdapter 2.44.0, ctf-TestManager 1.42.0, ctf-TestReferenceAdapter 0.10.2, ctf-Tools 0.11.0
Repositoryssh://git@bitbucket.nordicsemi.no:7999/ncs-test/test-fw-nrfconnect-nrf_iot.git
Branchdetached
Commitd36b2f0b32f698804a525dd21f8aadd6c3ff60be
2025-05-07 07:53:54+02:00
Jorgen Kvalvaag, jorgen.kvalvaag@nordicsemi.no
thingy91: Update CONTENTS.txt files in release zips

Test Results Summary

Item(s) Under Test

LibmodemLteNone nrf_net For testing the libmodem library without explicitly setting network mode, on both 9160 and 91x1 DKs
LibmodemLtemNbiot nrf_net For testing the libmodem library with both LTE-M & NBIoT, on both 9160 and 91x1 DKs
LteNone nrf_net Used when no libary defines are set
WiFi_7002DK 7002dk
ble_mesh_model ble_mesh_model BLE Mesh models test profile
ble_mesh_samples ble_mesh_samples BLE Mesh test profile for samples with need for IOAdapter
ble_samples_newlib ble_samples_newlib BLE sample and profile tests
crypto_all crypto Crypto all
dtm dtm DTM tests
fmn fmn_examples This is the iut configuration for fmn examples
gateway_only gateway_tests Configuration for one gateway nRF5340 Audio DK
headset_only headset_tests Configuration for one headset nRF5340 Audio DK
nfc nfc_examples
nrf5340audio_mono nrf5340audio_mono_tests Configuration for one gateway and headset nRF5340 Audio DK
nrf5340audio_stereo nrf5340audio_stereo_tests Configuration for one gateway and headset nRF5340 Audio DK
nrf_provisioning nrf_net This IUT configuration to be used for tests using the nrf9160_pca10090 devkit.
rpc nrf_rpc
thingy91 nrf_net This IUT configuration to be used for tests using pca20035 board.

Summary

ALL PASSED ERROR FAILED MISSED IGNORED NOT_EXECUTEDUNSTABLE
UNIT tests: 3 3 0 0 0 0 0 0
interface 0 0 0 0 0 0 0 0
functional 3 3 0 0 0 0 0 0
nonfunctional 0 0 0 0 0 0 0 0
COMPONENT tests: 0 0 0 0 0 0 0 0
interface 0 0 0 0 0 0 0 0
functional 0 0 0 0 0 0 0 0
nonfunctional 0 0 0 0 0 0 0 0
INTEGRATION tests: 0 0 0 0 0 0 0 0
interface 0 0 0 0 0 0 0 0
functional 0 0 0 0 0 0 0 0
nonfunctional 0 0 0 0 0 0 0 0
SYSTEM tests: 297 133 0 0 0 0 164 0
interface 0 0 0 0 0 0 0 0
functional 297 133 0 0 0 0 164 0
nonfunctional 0 0 0 0 0 0 0 0
ACCEPTANCE tests: 253 103 0 0 0 6 144 0
interface 0 0 0 0 0 0 0 0
functional 238 103 0 0 0 6 129 0
nonfunctional 15 0 0 0 0 0 15 0
TOTAL 553 239 0 0 0 6 308 0
43.22% 0.00% 0.00% 0.00% 1.08% 55.70% 0.0%
Result Description
PASSED Test case passed.
ERROR Test case failed due to test framework issues.
FAILED Test case failed during execution ("assert").
MISSED Test case should have been executed.
IGNORED Test cases blocked e.g. due to bug (high risk). Usually disabled, see comments for detailed reason.
NOT_EXECUTED Test case has not been executed.


Test Suite by Configuration Variants

Test Suites as matrix of Test Procedures and DUTs
52840r252840r352bsim53405340adk5340app_ns5340r1app5340r1app_ns54h20fp154l15app54l15app_ns54lm20a_dk7002DK9160r2ns9161fnst91
Statistics - number of Test Cases
PASSED468060250316039118419
ERROR0000000000000000
FAILED0000000000000000
MISSED0000000000000000
IGNORED0003020001000000
NOT_EXECUTED520116186300884000300
incl. UNSTABLE0000000000000000
Test Suites
LibmodemLteNone_TestCiphersuitesSample 9160r2ns_tgt_gcc_f5a4
9161fns_tgt_gcc_dc93
LibmodemLteNone_TestLibmodemInitShutdownOffload 9160r2ns_tgt_gcc_f5a4
LibmodemLteNone_TestLibmodemMdmKeyMgmt 9160r2ns_tgt_gcc_f5a4
LibmodemLteNone_TestLibmodemOffload 9160r2ns_tgt_gcc_f5a4
LibmodemLteNone_TestModemCallbacksSample 9160r2ns_tgt_gcc_f5a4
9161fns_tgt_gcc_dc93
LibmodemLteNone_TestModemTraceBackendSample 9160r2ns_tgt_gcc_f5a4
9161fns_tgt_gcc_dc93
LibmodemLteNone_TestPDNSample 9160r2ns_tgt_gcc_f5a4
9161fns_tgt_gcc_dc93
LibmodemLtemNbiot_TestLibmodemIPOffload 9160r2ns_tgt_gcc_ltem_3005
LteNone_TestMultiServiceSample_1__0 9160r2ns_tgt_gcc_f5a4
LteNone_TestNrfCloudRestCellLocationSample_1__0 9160r2ns_tgt_gcc_f5a4
LteNone_TestNrfCloudRestDeviceMessageSample_1__0 9160r2ns_tgt_gcc_f5a4
LteNone_TestNrfCloudRestFotaSample_2__0 9160r2ns_tgt_gcc_f5a4
WiFi_7002DK_7002DK_RadioTest__24G_11ax20 7002DK_tgt_none_280e
WiFi_7002DK_7002DK_RadioTest__5G_11ax20 7002DK_tgt_none_280e
WiFi_7002DK_7002DK_ScanSampleTest 7002DK_tgt_none_280e
WiFi_7002DK_7002DK_ShellSample__wpa3sae 7002DK_tgt_none_280e
WiFi_7002DK_7002DK_TxInjectionSampleTest__24G_11ax20__wpa2psk 7002DK_tgt_none_280e
WiFi_7002DK_7002DK_TxInjectionSampleTest__5G_11ax20__wpa2psk 7002DK_tgt_none_280e
ble_mesh_model_mesh_model_LightCtrlTest 52840r2_tgt_gcc_sdc_f59b
52bsim_bsim_gcc_sdc_650b
5340_tgt_gcc_sdc_cef5
5340app_ns_tgt_gcc_sdc_43cc
54l15app_tgt_gcc_sdc_6f23
ble_mesh_samples_mesh_samples_MeshLightCtrlSample 52840r3_tgt_gcc_sdc_7bad
5340_tgt_gcc_sdc_cef5
5340app_ns_tgt_gcc_sdc_43cc
54l15app_tgt_gcc_sdc_6f23
ble_mesh_samples_mesh_samples_MeshLightDfuSample 52840r3_tgt_gcc_sdc_7bad
5340_tgt_gcc_sdc_cef5
5340app_ns_tgt_gcc_sdc_43cc
54l15app_tgt_gcc_sdc_6f23
ble_mesh_samples_mesh_samples_MeshLightDimmerSample 52840r3_tgt_gcc_sdc_7bad
5340_tgt_gcc_sdc_cef5
5340app_ns_tgt_gcc_sdc_43cc
54l15app_tgt_gcc_sdc_6f23
ble_mesh_samples_mesh_samples_MeshSensorServerSample 52840r3_tgt_gcc_sdc_7bad
5340_tgt_gcc_sdc_cef5
5340app_ns_tgt_gcc_sdc_43cc
54l15app_tgt_gcc_sdc_6f23
ble_samples_newlib_samples_newlib_TestSuiteHIDSMouse 52840r3_tgt_gcc_sdc_7bad
52840r3_tgt_gcc_sdc_newlib_3c3f
5340_tgt_0beb
5340_tgt_bd10
5340_tgt_gcc_rpc_c27b
54h20fp1_tgt_gcc_sdc_1f1b
54l15app_tgt_gcc_sdc_6f23
54lm20a_dk_tgt_gcc_sdc_3589
crypto_all_all_TestDtlsTargetClientEcdsa 5340r1app_tgt_gcc_cc3xx_oberon_4bea
5340r1app_ns_tgt_gcc_cc3xx_oberon_c236
54l15app_tgt_gcc_cracen_6f87
54l15app_ns_tgt_gcc_cracen_8e7d
crypto_all_all_TestDtlsTargetServerEcdsaSecp384r1 54l15app_tgt_gcc_cracen_6f87
54l15app_ns_tgt_gcc_cracen_8e7d
crypto_all_all_TestDtlsTargetServerEcdsa 5340r1app_tgt_gcc_cc3xx_oberon_4bea
5340r1app_ns_tgt_gcc_cc3xx_oberon_c236
54l15app_tgt_gcc_cracen_6f87
54l15app_ns_tgt_gcc_cracen_8e7d
crypto_all_all_TestTls13TargetClientEcdsa 5340r1app_tgt_gcc_cc3xx_oberon_4bea
5340r1app_ns_tgt_gcc_cc3xx_oberon_c236
54l15app_tgt_gcc_cracen_6f87
54l15app_ns_tgt_gcc_cracen_8e7d
crypto_all_all_TestTls13TargetServerEcdsa 5340r1app_tgt_gcc_cc3xx_oberon_4bea
5340r1app_ns_tgt_gcc_cc3xx_oberon_c236
54l15app_tgt_gcc_cracen_6f87
54l15app_ns_tgt_gcc_cracen_8e7d
crypto_all_all_TestTlsTargetClientEcdsa 5340r1app_tgt_gcc_cc3xx_legacy_bd64
5340r1app_tgt_gcc_cc3xx_oberon_4bea
5340r1app_ns_tgt_gcc_cc3xx_oberon_c236
54l15app_tgt_gcc_cracen_6f87
54l15app_ns_tgt_gcc_cracen_8e7d
crypto_all_all_TestTlsTargetServerEcdsaSecp384r1 54l15app_tgt_gcc_cracen_6f87
54l15app_ns_tgt_gcc_cracen_8e7d
crypto_all_all_TestTlsTargetServerEcdsa 5340r1app_tgt_gcc_cc3xx_legacy_bd64
5340r1app_tgt_gcc_cc3xx_oberon_4bea
5340r1app_ns_tgt_gcc_cc3xx_oberon_c236
54l15app_tgt_gcc_cracen_6f87
54l15app_ns_tgt_gcc_cracen_8e7d
dtm_TestSuiteRadioTestOnCommit 52840r3_tgt_gcc_ce4c
5340_tgt_2363
54h20fp1_tgt_87e3
54l15app_tgt_gcc_sdc_6f23
54lm20a_dk_tgt_gcc_sdc_3589
fmn_CoexistenceSampleTest 52840r2_tgt_gcc_70a5
54l15app_tgt_gcc_0791
fmn_NcsFmnToolsExtract 52840r2_tgt_gcc_70a5
fmn_NcsFmnToolsProvision 52840r2_tgt_gcc_70a5
fmn_NcsFmnToolsSuperBinary 52840r2_tgt_gcc_70a5
fmn_NfcReadoutUnpairedTests 52840r2_tgt_gcc_70a5
54l15app_tgt_gcc_0791
fmn_QualificationSampleTest 52840r2_tgt_gcc_70a5
54l15app_tgt_gcc_0791
fmn_SimpleSampleTest 52840r2_tgt_gcc_70a5
54l15app_tgt_gcc_0791
gateway_only_only_BuildGateway_anlg_fwd_cis_debug 5340adk_tgt_none_a46b
gateway_only_only_BuildGateway_digi_ret_cis_debug 5340adk_tgt_none_a46b
headset_only_only_BuildHeadset_anlg_fwd_cis_debug 5340adk_tgt_none_4a53
headset_only_only_BuildHeadset_digi_ret_cis_debug 5340adk_tgt_none_4a53
nfc_NfcNFCID1Change_t2t 52840r2_tgt_gcc_nfct2_71f9
5340r1app_tgt_gcc_nfct2_6179
54l15app_tgt_gcc_nfct2_a53a
nfc_NfcNFCID1Change_t4t 52840r2_tgt_gcc_nfct2_71f9
5340r1app_tgt_gcc_nfct2_6179
54l15app_tgt_gcc_nfct2_a53a
nfc_NfcNewlibWritableNdefTests_ 52840r2_tgt_gcc_nfct2_71f9
5340r1app_tgt_gcc_nfct2_6179
54l15app_tgt_gcc_nfct2_a53a
nfc_NfcRecordLaunchAppTests_ 52840r2_tgt_gcc_nfct2_71f9
5340r1app_tgt_gcc_nfct2_6179
54l15app_tgt_gcc_nfct2_a53a
nfc_NfcRecordTextNightlyTests_ 52840r2_tgt_gcc_nfct2_71f9
5340r1app_tgt_gcc_nfct2_6179
54l15app_tgt_gcc_nfct2_a53a
nfc_NfcRecordTextTests_ 52840r2_tgt_gcc_nfct2_71f9
5340r1app_tgt_gcc_nfct2_6179
54l15app_tgt_gcc_nfct2_a53a
nfc_NfcReliabilityBusySimulatorT2Tests_ 52840r2_tgt_gcc_nfct2_71f9
5340r1app_tgt_gcc_nfct2_6179
54l15app_tgt_gcc_nfct2_a53a
nfc_NfcReliabilityBusySimulatorT4Tests_ 52840r2_tgt_gcc_nfct2_71f9
5340r1app_tgt_gcc_nfct2_6179
54l15app_tgt_gcc_nfct2_a53a
nfc_NfcReliabilityTests_ 52840r2_tgt_gcc_nfct2_71f9
5340r1app_tgt_gcc_nfct2_6179
54l15app_tgt_gcc_nfct2_a53a
nfc_NfcReliabilityWriteTests_ 52840r2_tgt_gcc_nfct2_71f9
5340r1app_tgt_gcc_nfct2_6179
54l15app_tgt_gcc_nfct2_a53a
nfc_NfcT4TChainedFromPCDTests_ 52840r2_tgt_gcc_nfct2_71f9
5340r1app_tgt_gcc_nfct2_6179
54l15app_tgt_gcc_nfct2_a53a
nfc_NfcT4TChainedFromPICCTests_ 52840r2_tgt_gcc_nfct2_71f9
5340r1app_tgt_gcc_nfct2_6179
54l15app_tgt_gcc_nfct2_a53a
nfc_NfcTNEPTagTests_ 52840r2_tgt_gcc_nfct2_71f9
5340r1app_tgt_gcc_nfct2_6179
54l15app_tgt_gcc_nfct2_a53a
nfc_NfcWakeUpNightlyTests_ 52840r2_tgt_gcc_nfct2_71f9
5340r1app_tgt_gcc_nfct2_6179
54l15app_tgt_gcc_nfct2_a53a
nfc_NfcWakeUpTests_ 52840r2_tgt_gcc_nfct2_71f9
5340r1app_tgt_gcc_nfct2_6179
54l15app_tgt_gcc_nfct2_a53a
nfc_NfcWritableNdefBufferChangeTests_ 52840r2_tgt_gcc_nfct2_71f9
5340r1app_tgt_gcc_nfct2_6179
54l15app_tgt_gcc_nfct2_a53a
nfc_NfcWritableNdefNightlyTests_ 52840r2_tgt_gcc_nfct2_71f9
5340r1app_tgt_gcc_nfct2_6179
54l15app_tgt_gcc_nfct2_a53a
nfc_NfcWritableNdefTests_ 52840r2_tgt_gcc_nfct2_71f9
5340r1app_tgt_gcc_nfct2_6179
54l15app_tgt_gcc_nfct2_a53a
nrf5340audio_mono_mono_FuncMonoSmoketest_digi_h1_fwd_bis_debug 5340adk_tgt_none_4a53
nrf5340audio_stereo_stereo_OncommitStereoTest_digi_fwd_cis 5340adk_tgt_none_4a53
nrf_provisioning_provisioning_TestLwm2mClientIntegration_1 9160r2ns_tgt_zephyr_8ff1
nrf_provisioning_provisioning_TestLwm2mClientIntegration 9160r2ns_tgt_zephyr_8ff1
nrf_provisioning_provisioning_TestLwm2mOuluIntegration_1 9160r2ns_tgt_zephyr_8ff1
nrf_provisioning_provisioning_TestLwm2mOuluIntegration 9160r2ns_tgt_zephyr_8ff1
nrf_provisioning_provisioning_TestSLMIntegration_NativeTLS_1 9160r2ns_tgt_zephyr_8ff1
nrf_provisioning_provisioning_TestSLMIntegration_NativeTLS 9160r2ns_tgt_zephyr_8ff1
nrf_provisioning_provisioning_TestSLMIntegration_Normal_1 9160r2ns_tgt_zephyr_8ff1
nrf_provisioning_provisioning_TestSLMIntegration_Normal 9160r2ns_tgt_zephyr_8ff1
nrf_provisioning_provisioning_TestSLMLWM2MCarrier_1 9160r2ns_tgt_zephyr_8ff1
nrf_provisioning_provisioning_TestSLMLWM2MCarrier 9160r2ns_tgt_zephyr_8ff1
nrf_provisioning_provisioning_TestSLMQuitStr_default_1 9160r2ns_tgt_zephyr_8ff1
nrf_provisioning_provisioning_TestSLMQuitStr_default 9160r2ns_tgt_zephyr_8ff1
nrf_provisioning_provisioning_TestSLMQuitStr_var1_1 9160r2ns_tgt_zephyr_8ff1
nrf_provisioning_provisioning_TestSLMQuitStr_var1 9160r2ns_tgt_zephyr_8ff1
nrf_provisioning_provisioning_TestSLMQuitStr_var2_1 9160r2ns_tgt_zephyr_8ff1
nrf_provisioning_provisioning_TestSLMQuitStr_var2 9160r2ns_tgt_zephyr_8ff1
nrf_provisioning_provisioning_TestSLMQuitStr_var3_1 9160r2ns_tgt_zephyr_8ff1
nrf_provisioning_provisioning_TestSLMQuitStr_var3 9160r2ns_tgt_zephyr_8ff1
nrf_provisioning_provisioning_TestSLMTransport_NativeTLS_1 9160r2ns_tgt_zephyr_8ff1
nrf_provisioning_provisioning_TestSLMTransport_NativeTLS 9160r2ns_tgt_zephyr_8ff1
nrf_provisioning_provisioning_TestSLMTransport_Normal_1 9160r2ns_tgt_zephyr_8ff1
nrf_provisioning_provisioning_TestSLMTransport_Normal 9160r2ns_tgt_zephyr_8ff1
nrf_provisioning_provisioning_TestSLMUart_1 9160r2ns_tgt_zephyr_8ff1
nrf_provisioning_provisioning_TestSLMUart 9160r2ns_tgt_zephyr_8ff1
nrf_provisioning_provisioning_TestZephyrLwm2mClientOverlays_1 9160r2ns_tgt_zephyr_8ff1
nrf_provisioning_provisioning_TestZephyrLwm2mClientOverlays 9160r2ns_tgt_zephyr_8ff1
rpc_TestSuiteRPCEntropy 5340r1app_tgt_gcc_e3af
thingy91_TestAwsIotNatSim t91_tgt_zephyr_5446
thingy91_TestAzureIotNatSim t91_tgt_zephyr_5446
thingy91_TestCoapClientSampleNatSim t91_tgt_zephyr_5446
thingy91_TestDownloadClientNatSim t91_tgt_zephyr_5446
thingy91_TestHttpServerNatSim t91_tgt_zephyr_5446
thingy91_TestHttpsClientNatSim t91_tgt_zephyr_5446
thingy91_TestMqttClientSampleNatSim t91_tgt_zephyr_5446
thingy91_TestUDPSampleNatSim t91_tgt_zephyr_5446




Non-PASS Results

IGNORED Tests

Interface Tests

None

Functional Tests


ble_mesh_samples_MeshLightDfuSample_5340_tgt_gcc_sdc_cef5__52840r3_gcc_sdc_c6d0
Test Case Result Duration [s]
All PASSED ERROR FAILED MISSED IGNORED NOT_EXECUTED
1 0 0 0 0 1 0
test_light_provision_pb_gatt IGNORED N/A  

Verdict message: DISABLED, DFU overlay is not supported for nRF5340dk, NCSDK-29097

Test Suite duration: N/A  
Go: mesh_samples_MeshLightDfuSample or Back

ble_mesh_samples_MeshLightDfuSample_5340app_ns_tgt_gcc_sdc_43cc__52840r3_gcc_sdc_c6d0
Test Case Result Duration [s]
All PASSED ERROR FAILED MISSED IGNORED NOT_EXECUTED
1 0 0 0 0 1 0
test_light_provision_pb_gatt IGNORED N/A  

Verdict message: DISABLED, DFU overlay is not supported for nRF5340dk, NCSDK-29097

Test Suite duration: N/A  
Go: mesh_samples_MeshLightDfuSample or Back

ble_mesh_samples_MeshLightDfuSample_54l15app_tgt_gcc_sdc_6f23__52840r3_gcc_sdc_c6d0
Test Case Result Duration [s]
All PASSED ERROR FAILED MISSED IGNORED NOT_EXECUTED
1 0 0 0 0 1 0
test_light_provision_pb_gatt IGNORED N/A  

Verdict message: DISABLED, DFU overlay is not supported for nRF5340dk, NCSDK-29097

Test Suite duration: N/A  
Go: mesh_samples_MeshLightDfuSample or Back

ble_mesh_samples_MeshSensorServerSample_5340_tgt_gcc_sdc_cef5__52840r3_gcc_sdc_c6d0
Test Case Result Duration [s]
All PASSED ERROR FAILED MISSED IGNORED NOT_EXECUTED
1 0 0 0 0 1 0
test_sensor IGNORED N/A  

Verdict message: DISABLED, Sample is not supported for nRF5340dk

Test Suite duration: N/A  
Go: mesh_samples_MeshSensorServerSample or Back

ble_mesh_samples_MeshSensorServerSample_5340app_ns_tgt_gcc_sdc_43cc__52840r3_gcc_sdc_c6d0
Test Case Result Duration [s]
All PASSED ERROR FAILED MISSED IGNORED NOT_EXECUTED
1 0 0 0 0 1 0
test_sensor IGNORED N/A  

Verdict message: DISABLED, Sample is not supported for nRF5340dk

Test Suite duration: N/A  
Go: mesh_samples_MeshSensorServerSample or Back

ble_samples_newlib_TestSuiteHIDSMouse_5340_tgt_gcc_rpc_c27b__5340_gcc_sdc_c180
Test Case Result Duration [s]
All PASSED ERROR FAILED MISSED IGNORED NOT_EXECUTED
1 0 0 0 0 1 0
test_hids_mouse_sanity_test IGNORED N/A  

Verdict message: DISABLED, Disabled for comp_eagle, Disabled RPC conf (sysbuild issue?) NCSDK-29444

Test Suite duration: N/A  
Go: samples_newlib_TestSuiteHIDSMouse or Back

Nonfunctional Tests

None

NOT_EXECUTED Tests

Interface Tests

None

Functional Tests


LibmodemLteNone_TestLibmodemMdmKeyMgmt_9160r2ns_tgt_gcc_f5a4
Test Case Result Duration [s]
All PASSED ERROR FAILED MISSED IGNORED NOT_EXECUTED
5 4 0 0 0 0 1
test_key_mgmt_large_cert NOT_EXECUTED 0.00  

Verdict message:

None
Test Suite duration: N/A  
Go: TestLibmodemMdmKeyMgmt or Back

ble_mesh_model_LightCtrlTest_52840r2_tgt_gcc_sdc_f59b__b76774ee
Test Case Result Duration [s]
All PASSED ERROR FAILED MISSED IGNORED NOT_EXECUTED
1 0 0 0 0 0 1
test_scene_storage NOT_EXECUTED N/A  

Verdict message:

None
Test Suite duration: N/A  
Go: mesh_model_LightCtrlTest or Back

ble_mesh_model_LightCtrlTest_52bsim_bsim_gcc_sdc_650b__52bsim_gcc_sdc_7251
Test Case Result Duration [s]
All PASSED ERROR FAILED MISSED IGNORED NOT_EXECUTED
1 0 0 0 0 0 1
test_scene_storage NOT_EXECUTED N/A  

Verdict message:

None
Test Suite duration: N/A  
Go: mesh_model_LightCtrlTest or Back

ble_mesh_model_LightCtrlTest_5340_tgt_gcc_sdc_cef5__2df0d355
Test Case Result Duration [s]
All PASSED ERROR FAILED MISSED IGNORED NOT_EXECUTED
1 0 0 0 0 0 1
test_scene_storage NOT_EXECUTED N/A  

Verdict message:

None
Test Suite duration: N/A  
Go: mesh_model_LightCtrlTest or Back

ble_mesh_model_LightCtrlTest_5340app_ns_tgt_gcc_sdc_43cc__6a35b764
Test Case Result Duration [s]
All PASSED ERROR FAILED MISSED IGNORED NOT_EXECUTED
1 0 0 0 0 0 1
test_scene_storage NOT_EXECUTED N/A  

Verdict message:

None
Test Suite duration: N/A  
Go: mesh_model_LightCtrlTest or Back

ble_mesh_model_LightCtrlTest_54l15app_tgt_gcc_sdc_6f23__c847677b
Test Case Result Duration [s]
All PASSED ERROR FAILED MISSED IGNORED NOT_EXECUTED
1 0 0 0 0 0 1
test_scene_storage NOT_EXECUTED N/A  

Verdict message:

None
Test Suite duration: N/A  
Go: mesh_model_LightCtrlTest or Back

crypto_all_TestDtlsTargetClientEcdsa_5340r1app_ns_tgt_gcc_cc3xx_oberon_c236
Test Case Result Duration [s]
All PASSED ERROR FAILED MISSED IGNORED NOT_EXECUTED
5 0 0 0 0 0 5
test_host_server_target_client_ECDHE_ECDSA_AES128_CCM NOT_EXECUTED N/A  

Verdict message:

None
test_host_server_target_client_ECDHE_ECDSA_AES256_CCM NOT_EXECUTED N/A  

Verdict message:

None
test_host_server_target_client_ECDHE_ECDSA_AES256_GCM_SHA384 NOT_EXECUTED N/A  

Verdict message:

None
test_host_server_target_client_ECDHE_PSK_AES128_CBC_SHA256 NOT_EXECUTED N/A  

Verdict message:

None
test_host_server_target_client_ECDHE_PSK_CHACHA20_POLY1305 NOT_EXECUTED N/A  

Verdict message:

None
Test Suite duration: N/A  
Go: all_TestDtlsTargetClientEcdsa or Back

crypto_all_TestDtlsTargetClientEcdsa_5340r1app_tgt_gcc_cc3xx_oberon_4bea
Test Case Result Duration [s]
All PASSED ERROR FAILED MISSED IGNORED NOT_EXECUTED
5 0 0 0 0 0 5
test_host_server_target_client_ECDHE_ECDSA_AES128_CCM NOT_EXECUTED N/A  

Verdict message:

None
test_host_server_target_client_ECDHE_ECDSA_AES256_CCM NOT_EXECUTED N/A  

Verdict message:

None
test_host_server_target_client_ECDHE_ECDSA_AES256_GCM_SHA384 NOT_EXECUTED N/A  

Verdict message:

None
test_host_server_target_client_ECDHE_PSK_AES128_CBC_SHA256 NOT_EXECUTED N/A  

Verdict message:

None
test_host_server_target_client_ECDHE_PSK_CHACHA20_POLY1305 NOT_EXECUTED N/A  

Verdict message:

None
Test Suite duration: N/A  
Go: all_TestDtlsTargetClientEcdsa or Back

crypto_all_TestDtlsTargetClientEcdsa_54l15app_ns_tgt_gcc_cracen_8e7d
Test Case Result Duration [s]
All PASSED ERROR FAILED MISSED IGNORED NOT_EXECUTED
5 0 0 0 0 0 5
test_host_server_target_client_ECDHE_ECDSA_AES128_CCM NOT_EXECUTED N/A  

Verdict message:

None
test_host_server_target_client_ECDHE_ECDSA_AES256_CCM NOT_EXECUTED N/A  

Verdict message:

None
test_host_server_target_client_ECDHE_ECDSA_AES256_GCM_SHA384 NOT_EXECUTED N/A  

Verdict message:

None
test_host_server_target_client_ECDHE_PSK_AES128_CBC_SHA256 NOT_EXECUTED N/A  

Verdict message:

None
test_host_server_target_client_ECDHE_PSK_CHACHA20_POLY1305 NOT_EXECUTED N/A  

Verdict message:

None
Test Suite duration: N/A  
Go: all_TestDtlsTargetClientEcdsa or Back

crypto_all_TestDtlsTargetClientEcdsa_54l15app_tgt_gcc_cracen_6f87
Test Case Result Duration [s]
All PASSED ERROR FAILED MISSED IGNORED NOT_EXECUTED
5 0 0 0 0 0 5
test_host_server_target_client_ECDHE_ECDSA_AES128_CCM NOT_EXECUTED N/A  

Verdict message:

None
test_host_server_target_client_ECDHE_ECDSA_AES256_CCM NOT_EXECUTED N/A  

Verdict message:

None
test_host_server_target_client_ECDHE_ECDSA_AES256_GCM_SHA384 NOT_EXECUTED N/A  

Verdict message:

None
test_host_server_target_client_ECDHE_PSK_AES128_CBC_SHA256 NOT_EXECUTED N/A  

Verdict message:

None
test_host_server_target_client_ECDHE_PSK_CHACHA20_POLY1305 NOT_EXECUTED N/A  

Verdict message:

None
Test Suite duration: N/A  
Go: all_TestDtlsTargetClientEcdsa or Back

crypto_all_TestDtlsTargetServerEcdsaSecp384r1_54l15app_ns_tgt_gcc_cracen_8e7d
Test Case Result Duration [s]
All PASSED ERROR FAILED MISSED IGNORED NOT_EXECUTED
5 0 0 0 0 0 5
test_host_client_target_server_ECDHE_ECDSA_AES128_CCM NOT_EXECUTED N/A  

Verdict message:

None
test_host_client_target_server_ECDHE_ECDSA_AES256_CCM NOT_EXECUTED N/A  

Verdict message:

None
test_host_client_target_server_ECDHE_ECDSA_AES256_GCM_SHA384 NOT_EXECUTED N/A  

Verdict message:

None
test_host_client_target_server_ECDHE_PSK_AES128_CBC_SHA256 NOT_EXECUTED N/A  

Verdict message:

None
test_host_client_target_server_ECDHE_PSK_CHACHA20_POLY1305 NOT_EXECUTED N/A  

Verdict message:

None
Test Suite duration: N/A  
Go: all_TestDtlsTargetServerEcdsaSecp384r1 or Back

crypto_all_TestDtlsTargetServerEcdsaSecp384r1_54l15app_tgt_gcc_cracen_6f87
Test Case Result Duration [s]
All PASSED ERROR FAILED MISSED IGNORED NOT_EXECUTED
5 0 0 0 0 0 5
test_host_client_target_server_ECDHE_ECDSA_AES128_CCM NOT_EXECUTED N/A  

Verdict message:

None
test_host_client_target_server_ECDHE_ECDSA_AES256_CCM NOT_EXECUTED N/A  

Verdict message:

None
test_host_client_target_server_ECDHE_ECDSA_AES256_GCM_SHA384 NOT_EXECUTED N/A  

Verdict message:

None
test_host_client_target_server_ECDHE_PSK_AES128_CBC_SHA256 NOT_EXECUTED N/A  

Verdict message:

None
test_host_client_target_server_ECDHE_PSK_CHACHA20_POLY1305 NOT_EXECUTED N/A  

Verdict message:

None
Test Suite duration: N/A  
Go: all_TestDtlsTargetServerEcdsaSecp384r1 or Back

crypto_all_TestDtlsTargetServerEcdsa_5340r1app_ns_tgt_gcc_cc3xx_oberon_c236
Test Case Result Duration [s]
All PASSED ERROR FAILED MISSED IGNORED NOT_EXECUTED
5 0 0 0 0 0 5
test_host_client_target_server_ECDHE_ECDSA_AES128_CCM NOT_EXECUTED N/A  

Verdict message:

None
test_host_client_target_server_ECDHE_ECDSA_AES256_CCM NOT_EXECUTED N/A  

Verdict message:

None
test_host_client_target_server_ECDHE_ECDSA_AES256_GCM_SHA384 NOT_EXECUTED N/A  

Verdict message:

None
test_host_client_target_server_ECDHE_PSK_AES128_CBC_SHA256 NOT_EXECUTED N/A  

Verdict message:

None
test_host_client_target_server_ECDHE_PSK_CHACHA20_POLY1305 NOT_EXECUTED N/A  

Verdict message:

None
Test Suite duration: N/A  
Go: all_TestDtlsTargetServerEcdsa or Back

crypto_all_TestDtlsTargetServerEcdsa_5340r1app_tgt_gcc_cc3xx_oberon_4bea
Test Case Result Duration [s]
All PASSED ERROR FAILED MISSED IGNORED NOT_EXECUTED
5 0 0 0 0 0 5
test_host_client_target_server_ECDHE_ECDSA_AES128_CCM NOT_EXECUTED N/A  

Verdict message:

None
test_host_client_target_server_ECDHE_ECDSA_AES256_CCM NOT_EXECUTED N/A  

Verdict message:

None
test_host_client_target_server_ECDHE_ECDSA_AES256_GCM_SHA384 NOT_EXECUTED N/A  

Verdict message:

None
test_host_client_target_server_ECDHE_PSK_AES128_CBC_SHA256 NOT_EXECUTED N/A  

Verdict message:

None
test_host_client_target_server_ECDHE_PSK_CHACHA20_POLY1305 NOT_EXECUTED N/A  

Verdict message:

None
Test Suite duration: N/A  
Go: all_TestDtlsTargetServerEcdsa or Back

crypto_all_TestDtlsTargetServerEcdsa_54l15app_ns_tgt_gcc_cracen_8e7d
Test Case Result Duration [s]
All PASSED ERROR FAILED MISSED IGNORED NOT_EXECUTED
5 0 0 0 0 0 5
test_host_client_target_server_ECDHE_ECDSA_AES128_CCM NOT_EXECUTED N/A  

Verdict message:

None
test_host_client_target_server_ECDHE_ECDSA_AES256_CCM NOT_EXECUTED N/A  

Verdict message:

None
test_host_client_target_server_ECDHE_ECDSA_AES256_GCM_SHA384 NOT_EXECUTED N/A  

Verdict message:

None
test_host_client_target_server_ECDHE_PSK_AES128_CBC_SHA256 NOT_EXECUTED N/A  

Verdict message:

None
test_host_client_target_server_ECDHE_PSK_CHACHA20_POLY1305 NOT_EXECUTED N/A  

Verdict message:

None
Test Suite duration: N/A  
Go: all_TestDtlsTargetServerEcdsa or Back

crypto_all_TestDtlsTargetServerEcdsa_54l15app_tgt_gcc_cracen_6f87
Test Case Result Duration [s]
All PASSED ERROR FAILED MISSED IGNORED NOT_EXECUTED
5 0 0 0 0 0 5
test_host_client_target_server_ECDHE_ECDSA_AES128_CCM NOT_EXECUTED N/A  

Verdict message:

None
test_host_client_target_server_ECDHE_ECDSA_AES256_CCM NOT_EXECUTED N/A  

Verdict message:

None
test_host_client_target_server_ECDHE_ECDSA_AES256_GCM_SHA384 NOT_EXECUTED N/A  

Verdict message:

None
test_host_client_target_server_ECDHE_PSK_AES128_CBC_SHA256 NOT_EXECUTED N/A  

Verdict message:

None
test_host_client_target_server_ECDHE_PSK_CHACHA20_POLY1305 NOT_EXECUTED N/A  

Verdict message:

None
Test Suite duration: N/A  
Go: all_TestDtlsTargetServerEcdsa or Back

crypto_all_TestTls13TargetClientEcdsa_5340r1app_ns_tgt_gcc_cc3xx_oberon_c236
Test Case Result Duration [s]
All PASSED ERROR FAILED MISSED IGNORED NOT_EXECUTED
5 0 0 0 0 0 5
test_host_server_target_client_TLS_AES_128_CCM_8_SHA256 NOT_EXECUTED N/A  

Verdict message:

None
test_host_server_target_client_TLS_AES_128_CCM_SHA256 NOT_EXECUTED N/A  

Verdict message:

None
test_host_server_target_client_TLS_AES_128_GCM_SHA256 NOT_EXECUTED N/A  

Verdict message:

None
test_host_server_target_client_TLS_AES_256_GCM_SHA384 NOT_EXECUTED N/A  

Verdict message:

None
test_host_server_target_client_TLS_CHACHA20_POLY1305_SHA256 NOT_EXECUTED N/A  

Verdict message:

None
Test Suite duration: N/A  
Go: all_TestTls13TargetClientEcdsa or Back

crypto_all_TestTls13TargetClientEcdsa_5340r1app_tgt_gcc_cc3xx_oberon_4bea
Test Case Result Duration [s]
All PASSED ERROR FAILED MISSED IGNORED NOT_EXECUTED
5 0 0 0 0 0 5
test_host_server_target_client_TLS_AES_128_CCM_8_SHA256 NOT_EXECUTED N/A  

Verdict message:

None
test_host_server_target_client_TLS_AES_128_CCM_SHA256 NOT_EXECUTED N/A  

Verdict message:

None
test_host_server_target_client_TLS_AES_128_GCM_SHA256 NOT_EXECUTED N/A  

Verdict message:

None
test_host_server_target_client_TLS_AES_256_GCM_SHA384 NOT_EXECUTED N/A  

Verdict message:

None
test_host_server_target_client_TLS_CHACHA20_POLY1305_SHA256 NOT_EXECUTED N/A  

Verdict message:

None
Test Suite duration: N/A  
Go: all_TestTls13TargetClientEcdsa or Back

crypto_all_TestTls13TargetClientEcdsa_54l15app_ns_tgt_gcc_cracen_8e7d
Test Case Result Duration [s]
All PASSED ERROR FAILED MISSED IGNORED NOT_EXECUTED
5 0 0 0 0 0 5
test_host_server_target_client_TLS_AES_128_CCM_8_SHA256 NOT_EXECUTED N/A  

Verdict message:

None
test_host_server_target_client_TLS_AES_128_CCM_SHA256 NOT_EXECUTED N/A  

Verdict message:

None
test_host_server_target_client_TLS_AES_128_GCM_SHA256 NOT_EXECUTED N/A  

Verdict message:

None
test_host_server_target_client_TLS_AES_256_GCM_SHA384 NOT_EXECUTED N/A  

Verdict message:

None
test_host_server_target_client_TLS_CHACHA20_POLY1305_SHA256 NOT_EXECUTED N/A  

Verdict message:

None
Test Suite duration: N/A  
Go: all_TestTls13TargetClientEcdsa or Back

crypto_all_TestTls13TargetClientEcdsa_54l15app_tgt_gcc_cracen_6f87
Test Case Result Duration [s]
All PASSED ERROR FAILED MISSED IGNORED NOT_EXECUTED
5 0 0 0 0 0 5
test_host_server_target_client_TLS_AES_128_CCM_8_SHA256 NOT_EXECUTED N/A  

Verdict message:

None
test_host_server_target_client_TLS_AES_128_CCM_SHA256 NOT_EXECUTED N/A  

Verdict message:

None
test_host_server_target_client_TLS_AES_128_GCM_SHA256 NOT_EXECUTED N/A  

Verdict message:

None
test_host_server_target_client_TLS_AES_256_GCM_SHA384 NOT_EXECUTED N/A  

Verdict message:

None
test_host_server_target_client_TLS_CHACHA20_POLY1305_SHA256 NOT_EXECUTED N/A  

Verdict message:

None
Test Suite duration: N/A  
Go: all_TestTls13TargetClientEcdsa or Back

crypto_all_TestTls13TargetServerEcdsa_5340r1app_ns_tgt_gcc_cc3xx_oberon_c236
Test Case Result Duration [s]
All PASSED ERROR FAILED MISSED IGNORED NOT_EXECUTED
5 0 0 0 0 0 5
test_host_client_target_server_TLS_AES_128_CCM_8_SHA256 NOT_EXECUTED N/A  

Verdict message:

None
test_host_client_target_server_TLS_AES_128_CCM_SHA256 NOT_EXECUTED N/A  

Verdict message:

None
test_host_client_target_server_TLS_AES_128_GCM_SHA256 NOT_EXECUTED N/A  

Verdict message:

None
test_host_client_target_server_TLS_AES_256_GCM_SHA384 NOT_EXECUTED N/A  

Verdict message:

None
test_host_client_target_server_TLS_CHACHA20_POLY1305_SHA256 NOT_EXECUTED N/A  

Verdict message:

None
Test Suite duration: N/A  
Go: all_TestTls13TargetServerEcdsa or Back

crypto_all_TestTls13TargetServerEcdsa_5340r1app_tgt_gcc_cc3xx_oberon_4bea
Test Case Result Duration [s]
All PASSED ERROR FAILED MISSED IGNORED NOT_EXECUTED
5 0 0 0 0 0 5
test_host_client_target_server_TLS_AES_128_CCM_8_SHA256 NOT_EXECUTED N/A  

Verdict message:

None
test_host_client_target_server_TLS_AES_128_CCM_SHA256 NOT_EXECUTED N/A  

Verdict message:

None
test_host_client_target_server_TLS_AES_128_GCM_SHA256 NOT_EXECUTED N/A  

Verdict message:

None
test_host_client_target_server_TLS_AES_256_GCM_SHA384 NOT_EXECUTED N/A  

Verdict message:

None
test_host_client_target_server_TLS_CHACHA20_POLY1305_SHA256 NOT_EXECUTED N/A  

Verdict message:

None
Test Suite duration: N/A  
Go: all_TestTls13TargetServerEcdsa or Back

crypto_all_TestTls13TargetServerEcdsa_54l15app_ns_tgt_gcc_cracen_8e7d
Test Case Result Duration [s]
All PASSED ERROR FAILED MISSED IGNORED NOT_EXECUTED
5 0 0 0 0 0 5
test_host_client_target_server_TLS_AES_128_CCM_8_SHA256 NOT_EXECUTED N/A  

Verdict message:

None
test_host_client_target_server_TLS_AES_128_CCM_SHA256 NOT_EXECUTED N/A  

Verdict message:

None
test_host_client_target_server_TLS_AES_128_GCM_SHA256 NOT_EXECUTED N/A  

Verdict message:

None
test_host_client_target_server_TLS_AES_256_GCM_SHA384 NOT_EXECUTED N/A  

Verdict message:

None
test_host_client_target_server_TLS_CHACHA20_POLY1305_SHA256 NOT_EXECUTED N/A  

Verdict message:

None
Test Suite duration: N/A  
Go: all_TestTls13TargetServerEcdsa or Back

crypto_all_TestTls13TargetServerEcdsa_54l15app_tgt_gcc_cracen_6f87
Test Case Result Duration [s]
All PASSED ERROR FAILED MISSED IGNORED NOT_EXECUTED
5 0 0 0 0 0 5
test_host_client_target_server_TLS_AES_128_CCM_8_SHA256 NOT_EXECUTED N/A  

Verdict message:

None
test_host_client_target_server_TLS_AES_128_CCM_SHA256 NOT_EXECUTED N/A  

Verdict message:

None
test_host_client_target_server_TLS_AES_128_GCM_SHA256 NOT_EXECUTED N/A  

Verdict message:

None
test_host_client_target_server_TLS_AES_256_GCM_SHA384 NOT_EXECUTED N/A  

Verdict message:

None
test_host_client_target_server_TLS_CHACHA20_POLY1305_SHA256 NOT_EXECUTED N/A  

Verdict message:

None
Test Suite duration: N/A  
Go: all_TestTls13TargetServerEcdsa or Back

crypto_all_TestTlsTargetClientEcdsa_5340r1app_ns_tgt_gcc_cc3xx_oberon_c236
Test Case Result Duration [s]
All PASSED ERROR FAILED MISSED IGNORED NOT_EXECUTED
5 0 0 0 0 0 5
test_host_server_target_client_ECDHE_ECDSA_AES128_CCM NOT_EXECUTED N/A  

Verdict message:

None
test_host_server_target_client_ECDHE_ECDSA_AES256_CCM NOT_EXECUTED N/A  

Verdict message:

None
test_host_server_target_client_ECDHE_ECDSA_AES256_GCM_SHA384 NOT_EXECUTED N/A  

Verdict message:

None
test_host_server_target_client_ECDHE_PSK_AES128_CBC_SHA256 NOT_EXECUTED N/A  

Verdict message:

None
test_host_server_target_client_ECDHE_PSK_CHACHA20_POLY1305 NOT_EXECUTED N/A  

Verdict message:

None
Test Suite duration: N/A  
Go: all_TestTlsTargetClientEcdsa or Back

crypto_all_TestTlsTargetClientEcdsa_5340r1app_tgt_gcc_cc3xx_legacy_bd64
Test Case Result Duration [s]
All PASSED ERROR FAILED MISSED IGNORED NOT_EXECUTED
5 0 0 0 0 0 5
test_host_server_target_client_ECDHE_ECDSA_AES128_CCM NOT_EXECUTED N/A  

Verdict message:

None
test_host_server_target_client_ECDHE_ECDSA_AES256_CCM NOT_EXECUTED N/A  

Verdict message:

None
test_host_server_target_client_ECDHE_ECDSA_AES256_GCM_SHA384 NOT_EXECUTED N/A  

Verdict message:

None
test_host_server_target_client_ECDHE_PSK_AES128_CBC_SHA256 NOT_EXECUTED N/A  

Verdict message:

None
test_host_server_target_client_ECDHE_PSK_CHACHA20_POLY1305 NOT_EXECUTED N/A  

Verdict message:

None
Test Suite duration: N/A  
Go: all_TestTlsTargetClientEcdsa or Back

crypto_all_TestTlsTargetClientEcdsa_5340r1app_tgt_gcc_cc3xx_oberon_4bea
Test Case Result Duration [s]
All PASSED ERROR FAILED MISSED IGNORED NOT_EXECUTED
5 0 0 0 0 0 5
test_host_server_target_client_ECDHE_ECDSA_AES128_CCM NOT_EXECUTED N/A  

Verdict message:

None
test_host_server_target_client_ECDHE_ECDSA_AES256_CCM NOT_EXECUTED N/A  

Verdict message:

None
test_host_server_target_client_ECDHE_ECDSA_AES256_GCM_SHA384 NOT_EXECUTED N/A  

Verdict message:

None
test_host_server_target_client_ECDHE_PSK_AES128_CBC_SHA256 NOT_EXECUTED N/A  

Verdict message:

None
test_host_server_target_client_ECDHE_PSK_CHACHA20_POLY1305 NOT_EXECUTED N/A  

Verdict message:

None
Test Suite duration: N/A  
Go: all_TestTlsTargetClientEcdsa or Back

crypto_all_TestTlsTargetClientEcdsa_54l15app_ns_tgt_gcc_cracen_8e7d
Test Case Result Duration [s]
All PASSED ERROR FAILED MISSED IGNORED NOT_EXECUTED
5 0 0 0 0 0 5
test_host_server_target_client_ECDHE_ECDSA_AES128_CCM NOT_EXECUTED N/A  

Verdict message:

None
test_host_server_target_client_ECDHE_ECDSA_AES256_CCM NOT_EXECUTED N/A  

Verdict message:

None
test_host_server_target_client_ECDHE_ECDSA_AES256_GCM_SHA384 NOT_EXECUTED N/A  

Verdict message:

None
test_host_server_target_client_ECDHE_PSK_AES128_CBC_SHA256 NOT_EXECUTED N/A  

Verdict message:

None
test_host_server_target_client_ECDHE_PSK_CHACHA20_POLY1305 NOT_EXECUTED N/A  

Verdict message:

None
Test Suite duration: N/A  
Go: all_TestTlsTargetClientEcdsa or Back

crypto_all_TestTlsTargetClientEcdsa_54l15app_tgt_gcc_cracen_6f87
Test Case Result Duration [s]
All PASSED ERROR FAILED MISSED IGNORED NOT_EXECUTED
5 0 0 0 0 0 5
test_host_server_target_client_ECDHE_ECDSA_AES128_CCM NOT_EXECUTED N/A  

Verdict message:

None
test_host_server_target_client_ECDHE_ECDSA_AES256_CCM NOT_EXECUTED N/A  

Verdict message:

None
test_host_server_target_client_ECDHE_ECDSA_AES256_GCM_SHA384 NOT_EXECUTED N/A  

Verdict message:

None
test_host_server_target_client_ECDHE_PSK_AES128_CBC_SHA256 NOT_EXECUTED N/A  

Verdict message:

None
test_host_server_target_client_ECDHE_PSK_CHACHA20_POLY1305 NOT_EXECUTED N/A  

Verdict message:

None
Test Suite duration: N/A  
Go: all_TestTlsTargetClientEcdsa or Back

crypto_all_TestTlsTargetServerEcdsaSecp384r1_54l15app_ns_tgt_gcc_cracen_8e7d
Test Case Result Duration [s]
All PASSED ERROR FAILED MISSED IGNORED NOT_EXECUTED
5 0 0 0 0 0 5
test_host_client_target_server_ECDHE_ECDSA_AES128_CCM NOT_EXECUTED N/A  

Verdict message:

None
test_host_client_target_server_ECDHE_ECDSA_AES256_CCM NOT_EXECUTED N/A  

Verdict message:

None
test_host_client_target_server_ECDHE_ECDSA_AES256_GCM_SHA384 NOT_EXECUTED N/A  

Verdict message:

None
test_host_client_target_server_ECDHE_PSK_AES128_CBC_SHA256 NOT_EXECUTED N/A  

Verdict message:

None
test_host_client_target_server_ECDHE_PSK_CHACHA20_POLY1305 NOT_EXECUTED N/A  

Verdict message:

None
Test Suite duration: N/A  
Go: all_TestTlsTargetServerEcdsaSecp384r1 or Back

crypto_all_TestTlsTargetServerEcdsaSecp384r1_54l15app_tgt_gcc_cracen_6f87
Test Case Result Duration [s]
All PASSED ERROR FAILED MISSED IGNORED NOT_EXECUTED
5 0 0 0 0 0 5
test_host_client_target_server_ECDHE_ECDSA_AES128_CCM NOT_EXECUTED N/A  

Verdict message:

None
test_host_client_target_server_ECDHE_ECDSA_AES256_CCM NOT_EXECUTED N/A  

Verdict message:

None
test_host_client_target_server_ECDHE_ECDSA_AES256_GCM_SHA384 NOT_EXECUTED N/A  

Verdict message:

None
test_host_client_target_server_ECDHE_PSK_AES128_CBC_SHA256 NOT_EXECUTED N/A  

Verdict message:

None
test_host_client_target_server_ECDHE_PSK_CHACHA20_POLY1305 NOT_EXECUTED N/A  

Verdict message:

None
Test Suite duration: N/A  
Go: all_TestTlsTargetServerEcdsaSecp384r1 or Back

crypto_all_TestTlsTargetServerEcdsa_5340r1app_ns_tgt_gcc_cc3xx_oberon_c236
Test Case Result Duration [s]
All PASSED ERROR FAILED MISSED IGNORED NOT_EXECUTED
5 0 0 0 0 0 5
test_host_client_target_server_ECDHE_ECDSA_AES128_CCM NOT_EXECUTED N/A  

Verdict message:

None
test_host_client_target_server_ECDHE_ECDSA_AES256_CCM NOT_EXECUTED N/A  

Verdict message:

None
test_host_client_target_server_ECDHE_ECDSA_AES256_GCM_SHA384 NOT_EXECUTED N/A  

Verdict message:

None
test_host_client_target_server_ECDHE_PSK_AES128_CBC_SHA256 NOT_EXECUTED N/A  

Verdict message:

None
test_host_client_target_server_ECDHE_PSK_CHACHA20_POLY1305 NOT_EXECUTED N/A  

Verdict message:

None
Test Suite duration: N/A  
Go: all_TestTlsTargetServerEcdsa or Back

crypto_all_TestTlsTargetServerEcdsa_5340r1app_tgt_gcc_cc3xx_legacy_bd64
Test Case Result Duration [s]
All PASSED ERROR FAILED MISSED IGNORED NOT_EXECUTED
5 0 0 0 0 0 5
test_host_client_target_server_ECDHE_ECDSA_AES128_CCM NOT_EXECUTED N/A  

Verdict message:

None
test_host_client_target_server_ECDHE_ECDSA_AES256_CCM NOT_EXECUTED N/A  

Verdict message:

None
test_host_client_target_server_ECDHE_ECDSA_AES256_GCM_SHA384 NOT_EXECUTED N/A  

Verdict message:

None
test_host_client_target_server_ECDHE_PSK_AES128_CBC_SHA256 NOT_EXECUTED N/A  

Verdict message:

None
test_host_client_target_server_ECDHE_PSK_CHACHA20_POLY1305 NOT_EXECUTED N/A  

Verdict message:

None
Test Suite duration: N/A  
Go: all_TestTlsTargetServerEcdsa or Back

crypto_all_TestTlsTargetServerEcdsa_5340r1app_tgt_gcc_cc3xx_oberon_4bea
Test Case Result Duration [s]
All PASSED ERROR FAILED MISSED IGNORED NOT_EXECUTED
5 0 0 0 0 0 5
test_host_client_target_server_ECDHE_ECDSA_AES128_CCM NOT_EXECUTED N/A  

Verdict message:

None
test_host_client_target_server_ECDHE_ECDSA_AES256_CCM NOT_EXECUTED N/A  

Verdict message:

None
test_host_client_target_server_ECDHE_ECDSA_AES256_GCM_SHA384 NOT_EXECUTED N/A  

Verdict message:

None
test_host_client_target_server_ECDHE_PSK_AES128_CBC_SHA256 NOT_EXECUTED N/A  

Verdict message:

None
test_host_client_target_server_ECDHE_PSK_CHACHA20_POLY1305 NOT_EXECUTED N/A  

Verdict message:

None
Test Suite duration: N/A  
Go: all_TestTlsTargetServerEcdsa or Back

crypto_all_TestTlsTargetServerEcdsa_54l15app_ns_tgt_gcc_cracen_8e7d
Test Case Result Duration [s]
All PASSED ERROR FAILED MISSED IGNORED NOT_EXECUTED
5 0 0 0 0 0 5
test_host_client_target_server_ECDHE_ECDSA_AES128_CCM NOT_EXECUTED N/A  

Verdict message:

None
test_host_client_target_server_ECDHE_ECDSA_AES256_CCM NOT_EXECUTED N/A  

Verdict message:

None
test_host_client_target_server_ECDHE_ECDSA_AES256_GCM_SHA384 NOT_EXECUTED N/A  

Verdict message:

None
test_host_client_target_server_ECDHE_PSK_AES128_CBC_SHA256 NOT_EXECUTED N/A  

Verdict message:

None
test_host_client_target_server_ECDHE_PSK_CHACHA20_POLY1305 NOT_EXECUTED N/A  

Verdict message:

None
Test Suite duration: N/A  
Go: all_TestTlsTargetServerEcdsa or Back

crypto_all_TestTlsTargetServerEcdsa_54l15app_tgt_gcc_cracen_6f87
Test Case Result Duration [s]
All PASSED ERROR FAILED MISSED IGNORED NOT_EXECUTED
5 0 0 0 0 0 5
test_host_client_target_server_ECDHE_ECDSA_AES128_CCM NOT_EXECUTED N/A  

Verdict message:

None
test_host_client_target_server_ECDHE_ECDSA_AES256_CCM NOT_EXECUTED N/A  

Verdict message:

None
test_host_client_target_server_ECDHE_ECDSA_AES256_GCM_SHA384 NOT_EXECUTED N/A  

Verdict message:

None
test_host_client_target_server_ECDHE_PSK_AES128_CBC_SHA256 NOT_EXECUTED N/A  

Verdict message:

None
test_host_client_target_server_ECDHE_PSK_CHACHA20_POLY1305 NOT_EXECUTED N/A  

Verdict message:

None
Test Suite duration: N/A  
Go: all_TestTlsTargetServerEcdsa or Back

fmn_SimpleSampleTest_52840r2_tgt_gcc_70a5__9a72d0af
Test Case Result Duration [s]
All PASSED ERROR FAILED MISSED IGNORED NOT_EXECUTED
1 0 0 0 0 0 1
test_sanity_test NOT_EXECUTED N/A  

Verdict message:

None
Test Suite duration: N/A  
Go: SimpleSampleTest or Back

fmn_SimpleSampleTest_54l15app_tgt_gcc_0791__4f6efc41
Test Case Result Duration [s]
All PASSED ERROR FAILED MISSED IGNORED NOT_EXECUTED
1 0 0 0 0 0 1
test_sanity_test NOT_EXECUTED N/A  

Verdict message:

None
Test Suite duration: N/A  
Go: SimpleSampleTest or Back

gateway_only_BuildGateway_anlg_fwd_cis_debug_5340adk_tgt_none_a46b__52840r3_none_366b
Test Case Result Duration [s]
All PASSED ERROR FAILED MISSED IGNORED NOT_EXECUTED
1 0 0 0 0 0 1
test_build_deliverable NOT_EXECUTED N/A  

Verdict message:

None
Test Suite duration: N/A  
Go: only_BuildGateway_anlg_fwd_cis_debug or Back

gateway_only_BuildGateway_digi_ret_cis_debug_5340adk_tgt_none_a46b__52840r3_none_366b
Test Case Result Duration [s]
All PASSED ERROR FAILED MISSED IGNORED NOT_EXECUTED
1 0 0 0 0 0 1
test_build_deliverable NOT_EXECUTED N/A  

Verdict message:

None
Test Suite duration: N/A  
Go: only_BuildGateway_digi_ret_cis_debug or Back

headset_only_BuildHeadset_anlg_fwd_cis_debug_5340adk_tgt_none_4a53__52840r3_none_366b
Test Case Result Duration [s]
All PASSED ERROR FAILED MISSED IGNORED NOT_EXECUTED
1 0 0 0 0 0 1
test_build_deliverable NOT_EXECUTED N/A  

Verdict message:

None
Test Suite duration: N/A  
Go: only_BuildHeadset_anlg_fwd_cis_debug or Back

headset_only_BuildHeadset_digi_ret_cis_debug_5340adk_tgt_none_4a53__52840r3_none_366b
Test Case Result Duration [s]
All PASSED ERROR FAILED MISSED IGNORED NOT_EXECUTED
1 0 0 0 0 0 1
test_build_deliverable NOT_EXECUTED N/A  

Verdict message:

None
Test Suite duration: N/A  
Go: only_BuildHeadset_digi_ret_cis_debug or Back

nfc_NfcNFCID1Change_t2t_52840r2_tgt_gcc_nfct2_71f9__0336cc8a
Test Case Result Duration [s]
All PASSED ERROR FAILED MISSED IGNORED NOT_EXECUTED
6 0 0 0 0 0 6
test_1_0_default NOT_EXECUTED N/A  

Verdict message:

None
test_1_1_default NOT_EXECUTED N/A  

Verdict message:

None
test_1_2_default NOT_EXECUTED N/A  

Verdict message:

None
test_1_3_custom NOT_EXECUTED N/A  

Verdict message:

None
test_1_4_custom NOT_EXECUTED N/A  

Verdict message:

None
test_1_5_custom NOT_EXECUTED N/A  

Verdict message:

None
Test Suite duration: N/A  
Go: NfcNFCID1Change_t2t or Back

nfc_NfcNFCID1Change_t2t_5340r1app_tgt_gcc_nfct2_6179__99f47a86
Test Case Result Duration [s]
All PASSED ERROR FAILED MISSED IGNORED NOT_EXECUTED
6 0 0 0 0 0 6
test_1_0_default NOT_EXECUTED N/A  

Verdict message:

None
test_1_1_default NOT_EXECUTED N/A  

Verdict message:

None
test_1_2_default NOT_EXECUTED N/A  

Verdict message:

None
test_1_3_custom NOT_EXECUTED N/A  

Verdict message:

None
test_1_4_custom NOT_EXECUTED N/A  

Verdict message:

None
test_1_5_custom NOT_EXECUTED N/A  

Verdict message:

None
Test Suite duration: N/A  
Go: NfcNFCID1Change_t2t or Back

nfc_NfcNFCID1Change_t2t_54l15app_tgt_gcc_nfct2_a53a__e51617bc
Test Case Result Duration [s]
All PASSED ERROR FAILED MISSED IGNORED NOT_EXECUTED
6 0 0 0 0 0 6
test_1_0_default NOT_EXECUTED N/A  

Verdict message:

None
test_1_1_default NOT_EXECUTED N/A  

Verdict message:

None
test_1_2_default NOT_EXECUTED N/A  

Verdict message:

None
test_1_3_custom NOT_EXECUTED N/A  

Verdict message:

None
test_1_4_custom NOT_EXECUTED N/A  

Verdict message:

None
test_1_5_custom NOT_EXECUTED N/A  

Verdict message:

None
Test Suite duration: N/A  
Go: NfcNFCID1Change_t2t or Back

nfc_NfcNFCID1Change_t4t_52840r2_tgt_gcc_nfct2_71f9__0336cc8a
Test Case Result Duration [s]
All PASSED ERROR FAILED MISSED IGNORED NOT_EXECUTED
6 0 0 0 0 0 6
test_1_0_default NOT_EXECUTED N/A  

Verdict message:

None
test_1_1_default NOT_EXECUTED N/A  

Verdict message:

None
test_1_2_default NOT_EXECUTED N/A  

Verdict message:

None
test_1_3_custom NOT_EXECUTED N/A  

Verdict message:

None
test_1_4_custom NOT_EXECUTED N/A  

Verdict message:

None
test_1_5_custom NOT_EXECUTED N/A  

Verdict message:

None
Test Suite duration: N/A  
Go: NfcNFCID1Change_t4t or Back

nfc_NfcNFCID1Change_t4t_5340r1app_tgt_gcc_nfct2_6179__99f47a86
Test Case Result Duration [s]
All PASSED ERROR FAILED MISSED IGNORED NOT_EXECUTED
6 0 0 0 0 0 6
test_1_0_default NOT_EXECUTED N/A  

Verdict message:

None
test_1_1_default NOT_EXECUTED N/A  

Verdict message:

None
test_1_2_default NOT_EXECUTED N/A  

Verdict message:

None
test_1_3_custom NOT_EXECUTED N/A  

Verdict message:

None
test_1_4_custom NOT_EXECUTED N/A  

Verdict message:

None
test_1_5_custom NOT_EXECUTED N/A  

Verdict message:

None
Test Suite duration: N/A  
Go: NfcNFCID1Change_t4t or Back

nfc_NfcNFCID1Change_t4t_54l15app_tgt_gcc_nfct2_a53a__e51617bc
Test Case Result Duration [s]
All PASSED ERROR FAILED MISSED IGNORED NOT_EXECUTED
6 0 0 0 0 0 6
test_1_0_default NOT_EXECUTED N/A  

Verdict message:

None
test_1_1_default NOT_EXECUTED N/A  

Verdict message:

None
test_1_2_default NOT_EXECUTED N/A  

Verdict message:

None
test_1_3_custom NOT_EXECUTED N/A  

Verdict message:

None
test_1_4_custom NOT_EXECUTED N/A  

Verdict message:

None
test_1_5_custom NOT_EXECUTED N/A  

Verdict message:

None
Test Suite duration: N/A  
Go: NfcNFCID1Change_t4t or Back

nfc_NfcNewlibWritableNdefTests__52840r2_tgt_gcc_nfct2_71f9__0336cc8a
Test Case Result Duration [s]
All PASSED ERROR FAILED MISSED IGNORED NOT_EXECUTED
3 0 0 0 0 0 3
test_1_nfc_newlib_writable_ndef_message_0_url NOT_EXECUTED N/A  

Verdict message:

None
test_1_nfc_newlib_writable_ndef_message_1_empty NOT_EXECUTED N/A  

Verdict message:

None
test_1_nfc_newlib_writable_ndef_message_2_special_characters NOT_EXECUTED N/A  

Verdict message:

None
Test Suite duration: N/A  
Go: NfcNewlibWritableNdefTests_ or Back

nfc_NfcNewlibWritableNdefTests__5340r1app_tgt_gcc_nfct2_6179__99f47a86
Test Case Result Duration [s]
All PASSED ERROR FAILED MISSED IGNORED NOT_EXECUTED
3 0 0 0 0 0 3
test_1_nfc_newlib_writable_ndef_message_0_url NOT_EXECUTED N/A  

Verdict message:

None
test_1_nfc_newlib_writable_ndef_message_1_empty NOT_EXECUTED N/A  

Verdict message:

None
test_1_nfc_newlib_writable_ndef_message_2_special_characters NOT_EXECUTED N/A  

Verdict message:

None
Test Suite duration: N/A  
Go: NfcNewlibWritableNdefTests_ or Back

nfc_NfcNewlibWritableNdefTests__54l15app_tgt_gcc_nfct2_a53a__e51617bc
Test Case Result Duration [s]
All PASSED ERROR FAILED MISSED IGNORED NOT_EXECUTED
3 0 0 0 0 0 3
test_1_nfc_newlib_writable_ndef_message_0_url NOT_EXECUTED N/A  

Verdict message:

None
test_1_nfc_newlib_writable_ndef_message_1_empty NOT_EXECUTED N/A  

Verdict message:

None
test_1_nfc_newlib_writable_ndef_message_2_special_characters NOT_EXECUTED N/A  

Verdict message:

None
Test Suite duration: N/A  
Go: NfcNewlibWritableNdefTests_ or Back

nfc_NfcRecordLaunchAppTests__52840r2_tgt_gcc_nfct2_71f9__0336cc8a
Test Case Result Duration [s]
All PASSED ERROR FAILED MISSED IGNORED NOT_EXECUTED
1 0 0 0 0 0 1
test_1_nfc_launch_app NOT_EXECUTED N/A  

Verdict message:

None
Test Suite duration: N/A  
Go: NfcRecordLaunchAppTests_ or Back

nfc_NfcRecordTextNightlyTests__52840r2_tgt_gcc_nfct2_71f9__0336cc8a
Test Case Result Duration [s]
All PASSED ERROR FAILED MISSED IGNORED NOT_EXECUTED
3 0 0 0 0 0 3
test_1_nfc_record_text NOT_EXECUTED N/A  

Verdict message:

None
test_3_nfc_record_text_write_invalid_0_cmd NOT_EXECUTED N/A  

Verdict message:

None
test_3_nfc_record_text_write_invalid_1_message_length NOT_EXECUTED N/A  

Verdict message:

None
Test Suite duration: N/A  
Go: NfcRecordTextNightlyTests_ or Back

nfc_NfcRecordTextNightlyTests__5340r1app_tgt_gcc_nfct2_6179__99f47a86
Test Case Result Duration [s]
All PASSED ERROR FAILED MISSED IGNORED NOT_EXECUTED
3 0 0 0 0 0 3
test_1_nfc_record_text NOT_EXECUTED N/A  

Verdict message:

None
test_3_nfc_record_text_write_invalid_0_cmd NOT_EXECUTED N/A  

Verdict message:

None
test_3_nfc_record_text_write_invalid_1_message_length NOT_EXECUTED N/A  

Verdict message:

None
Test Suite duration: N/A  
Go: NfcRecordTextNightlyTests_ or Back

nfc_NfcRecordTextNightlyTests__54l15app_tgt_gcc_nfct2_a53a__e51617bc
Test Case Result Duration [s]
All PASSED ERROR FAILED MISSED IGNORED NOT_EXECUTED
3 0 0 0 0 0 3
test_1_nfc_record_text NOT_EXECUTED N/A  

Verdict message:

None
test_3_nfc_record_text_write_invalid_0_cmd NOT_EXECUTED N/A  

Verdict message:

None
test_3_nfc_record_text_write_invalid_1_message_length NOT_EXECUTED N/A  

Verdict message:

None
Test Suite duration: N/A  
Go: NfcRecordTextNightlyTests_ or Back

nfc_NfcRecordTextTests__52840r2_tgt_gcc_nfct2_71f9__0336cc8a
Test Case Result Duration [s]
All PASSED ERROR FAILED MISSED IGNORED NOT_EXECUTED
1 0 0 0 0 0 1
test_1_nfc_record_text_write NOT_EXECUTED N/A  

Verdict message:

None
Test Suite duration: N/A  
Go: NfcRecordTextTests_ or Back

nfc_NfcT4TChainedFromPCDTests__52840r2_tgt_gcc_nfct2_71f9__0336cc8a
Test Case Result Duration [s]
All PASSED ERROR FAILED MISSED IGNORED NOT_EXECUTED
1 0 0 0 0 0 1
test_1_isodep_chaining_from_reader_to_tag NOT_EXECUTED N/A  

Verdict message:

None
Test Suite duration: N/A  
Go: NfcT4TChainedFromPCDTests_ or Back

nfc_NfcT4TChainedFromPCDTests__5340r1app_tgt_gcc_nfct2_6179__99f47a86
Test Case Result Duration [s]
All PASSED ERROR FAILED MISSED IGNORED NOT_EXECUTED
1 0 0 0 0 0 1
test_1_isodep_chaining_from_reader_to_tag NOT_EXECUTED N/A  

Verdict message:

None
Test Suite duration: N/A  
Go: NfcT4TChainedFromPCDTests_ or Back

nfc_NfcT4TChainedFromPCDTests__54l15app_tgt_gcc_nfct2_a53a__e51617bc
Test Case Result Duration [s]
All PASSED ERROR FAILED MISSED IGNORED NOT_EXECUTED
1 0 0 0 0 0 1
test_1_isodep_chaining_from_reader_to_tag NOT_EXECUTED N/A  

Verdict message:

None
Test Suite duration: N/A  
Go: NfcT4TChainedFromPCDTests_ or Back

nfc_NfcT4TChainedFromPICCTests__52840r2_tgt_gcc_nfct2_71f9__0336cc8a
Test Case Result Duration [s]
All PASSED ERROR FAILED MISSED IGNORED NOT_EXECUTED
1 0 0 0 0 0 1
test_1_isodep_chaining_from_tag_to_reader NOT_EXECUTED N/A  

Verdict message:

None
Test Suite duration: N/A  
Go: NfcT4TChainedFromPICCTests_ or Back

nfc_NfcT4TChainedFromPICCTests__5340r1app_tgt_gcc_nfct2_6179__99f47a86
Test Case Result Duration [s]
All PASSED ERROR FAILED MISSED IGNORED NOT_EXECUTED
1 0 0 0 0 0 1
test_1_isodep_chaining_from_tag_to_reader NOT_EXECUTED N/A  

Verdict message:

None
Test Suite duration: N/A  
Go: NfcT4TChainedFromPICCTests_ or Back

nfc_NfcT4TChainedFromPICCTests__54l15app_tgt_gcc_nfct2_a53a__e51617bc
Test Case Result Duration [s]
All PASSED ERROR FAILED MISSED IGNORED NOT_EXECUTED
1 0 0 0 0 0 1
test_1_isodep_chaining_from_tag_to_reader NOT_EXECUTED N/A  

Verdict message:

None
Test Suite duration: N/A  
Go: NfcT4TChainedFromPICCTests_ or Back

nfc_NfcTNEPTagTests__52840r2_tgt_gcc_nfct2_71f9__0336cc8a
Test Case Result Duration [s]
All PASSED ERROR FAILED MISSED IGNORED NOT_EXECUTED
8 0 0 0 0 0 8
test_1 NOT_EXECUTED N/A  

Verdict message:

None
test_2_0 NOT_EXECUTED N/A  

Verdict message:

None
test_2_1 NOT_EXECUTED N/A  

Verdict message:

None
test_3 NOT_EXECUTED N/A  

Verdict message:

None
test_4 NOT_EXECUTED N/A  

Verdict message:

None
test_5 NOT_EXECUTED N/A  

Verdict message:

None
test_6 NOT_EXECUTED N/A  

Verdict message:

None
test_7 NOT_EXECUTED N/A  

Verdict message:

None
Test Suite duration: N/A  
Go: NfcTNEPTagTests_ or Back

nfc_NfcTNEPTagTests__5340r1app_tgt_gcc_nfct2_6179__99f47a86
Test Case Result Duration [s]
All PASSED ERROR FAILED MISSED IGNORED NOT_EXECUTED
8 0 0 0 0 0 8
test_1 NOT_EXECUTED N/A  

Verdict message:

None
test_2_0 NOT_EXECUTED N/A  

Verdict message:

None
test_2_1 NOT_EXECUTED N/A  

Verdict message:

None
test_3 NOT_EXECUTED N/A  

Verdict message:

None
test_4 NOT_EXECUTED N/A  

Verdict message:

None
test_5 NOT_EXECUTED N/A  

Verdict message:

None
test_6 NOT_EXECUTED N/A  

Verdict message:

None
test_7 NOT_EXECUTED N/A  

Verdict message:

None
Test Suite duration: N/A  
Go: NfcTNEPTagTests_ or Back

nfc_NfcTNEPTagTests__54l15app_tgt_gcc_nfct2_a53a__e51617bc
Test Case Result Duration [s]
All PASSED ERROR FAILED MISSED IGNORED NOT_EXECUTED
8 0 0 0 0 0 8
test_1 NOT_EXECUTED N/A  

Verdict message:

None
test_2_0 NOT_EXECUTED N/A  

Verdict message:

None
test_2_1 NOT_EXECUTED N/A  

Verdict message:

None
test_3 NOT_EXECUTED N/A  

Verdict message:

None
test_4 NOT_EXECUTED N/A  

Verdict message:

None
test_5 NOT_EXECUTED N/A  

Verdict message:

None
test_6 NOT_EXECUTED N/A  

Verdict message:

None
test_7 NOT_EXECUTED N/A  

Verdict message:

None
Test Suite duration: N/A  
Go: NfcTNEPTagTests_ or Back

nfc_NfcWakeUpNightlyTests__52840r2_tgt_gcc_nfct2_71f9__0336cc8a
Test Case Result Duration [s]
All PASSED ERROR FAILED MISSED IGNORED NOT_EXECUTED
4 0 0 0 0 0 4
test_1_system_is_going_to_sleep NOT_EXECUTED N/A  

Verdict message:

None
test_2_system_off_interrupted NOT_EXECUTED N/A  

Verdict message:

None
test_3_system_off_current_consumption NOT_EXECUTED N/A  

Verdict message:

None
test_4_system_off_current_consumtion_off_after_wakeup NOT_EXECUTED N/A  

Verdict message:

None
Test Suite duration: N/A  
Go: NfcWakeUpNightlyTests_ or Back

nfc_NfcWakeUpNightlyTests__5340r1app_tgt_gcc_nfct2_6179__99f47a86
Test Case Result Duration [s]
All PASSED ERROR FAILED MISSED IGNORED NOT_EXECUTED
4 0 0 0 0 0 4
test_1_system_is_going_to_sleep NOT_EXECUTED N/A  

Verdict message:

None
test_2_system_off_interrupted NOT_EXECUTED N/A  

Verdict message:

None
test_3_system_off_current_consumption NOT_EXECUTED N/A  

Verdict message:

None
test_4_system_off_current_consumtion_off_after_wakeup NOT_EXECUTED N/A  

Verdict message:

None
Test Suite duration: N/A  
Go: NfcWakeUpNightlyTests_ or Back

nfc_NfcWakeUpNightlyTests__54l15app_tgt_gcc_nfct2_a53a__e51617bc
Test Case Result Duration [s]
All PASSED ERROR FAILED MISSED IGNORED NOT_EXECUTED
4 0 0 0 0 0 4
test_1_system_is_going_to_sleep NOT_EXECUTED N/A  

Verdict message:

None
test_2_system_off_interrupted NOT_EXECUTED N/A  

Verdict message:

None
test_3_system_off_current_consumption NOT_EXECUTED N/A  

Verdict message:

None
test_4_system_off_current_consumtion_off_after_wakeup NOT_EXECUTED N/A  

Verdict message:

None
Test Suite duration: N/A  
Go: NfcWakeUpNightlyTests_ or Back

nfc_NfcWakeUpTests__52840r2_tgt_gcc_nfct2_71f9__0336cc8a
Test Case Result Duration [s]
All PASSED ERROR FAILED MISSED IGNORED NOT_EXECUTED
1 0 0 0 0 0 1
test_1_nfc_wake_up NOT_EXECUTED N/A  

Verdict message:

None
Test Suite duration: N/A  
Go: NfcWakeUpTests_ or Back

nfc_NfcWritableNdefBufferChangeTests__52840r2_tgt_gcc_nfct2_71f9__0336cc8a
Test Case Result Duration [s]
All PASSED ERROR FAILED MISSED IGNORED NOT_EXECUTED
7 0 0 0 0 0 7
test_1_buffer_change_on_demand NOT_EXECUTED N/A  

Verdict message:

None
test_2_buffer_can_be_changed_back NOT_EXECUTED N/A  

Verdict message:

None
test_3_buffer_content_change_to_custom_value NOT_EXECUTED N/A  

Verdict message:

None
test_4_activated_buffer_resets_to_default_after_device_reset NOT_EXECUTED N/A  

Verdict message:

None
test_5_buffer_value_resets_to_default_after_device_reset NOT_EXECUTED N/A  

Verdict message:

None
test_6_content_change_does_not_effect_swap_functionality NOT_EXECUTED N/A  

Verdict message:

None
test_7_buffer_change_to_currently_used_one_not_break_device NOT_EXECUTED N/A  

Verdict message:

None
Test Suite duration: N/A  
Go: NfcWritableNdefBufferChangeTests_ or Back

nfc_NfcWritableNdefBufferChangeTests__5340r1app_tgt_gcc_nfct2_6179__99f47a86
Test Case Result Duration [s]
All PASSED ERROR FAILED MISSED IGNORED NOT_EXECUTED
7 0 0 0 0 0 7
test_1_buffer_change_on_demand NOT_EXECUTED N/A  

Verdict message:

None
test_2_buffer_can_be_changed_back NOT_EXECUTED N/A  

Verdict message:

None
test_3_buffer_content_change_to_custom_value NOT_EXECUTED N/A  

Verdict message:

None
test_4_activated_buffer_resets_to_default_after_device_reset NOT_EXECUTED N/A  

Verdict message:

None
test_5_buffer_value_resets_to_default_after_device_reset NOT_EXECUTED N/A  

Verdict message:

None
test_6_content_change_does_not_effect_swap_functionality NOT_EXECUTED N/A  

Verdict message:

None
test_7_buffer_change_to_currently_used_one_not_break_device NOT_EXECUTED N/A  

Verdict message:

None
Test Suite duration: N/A  
Go: NfcWritableNdefBufferChangeTests_ or Back

nfc_NfcWritableNdefBufferChangeTests__54l15app_tgt_gcc_nfct2_a53a__e51617bc
Test Case Result Duration [s]
All PASSED ERROR FAILED MISSED IGNORED NOT_EXECUTED
7 0 0 0 0 0 7
test_1_buffer_change_on_demand NOT_EXECUTED N/A  

Verdict message:

None
test_2_buffer_can_be_changed_back NOT_EXECUTED N/A  

Verdict message:

None
test_3_buffer_content_change_to_custom_value NOT_EXECUTED N/A  

Verdict message:

None
test_4_activated_buffer_resets_to_default_after_device_reset NOT_EXECUTED N/A  

Verdict message:

None
test_5_buffer_value_resets_to_default_after_device_reset NOT_EXECUTED N/A  

Verdict message:

None
test_6_content_change_does_not_effect_swap_functionality NOT_EXECUTED N/A  

Verdict message:

None
test_7_buffer_change_to_currently_used_one_not_break_device NOT_EXECUTED N/A  

Verdict message:

None
Test Suite duration: N/A  
Go: NfcWritableNdefBufferChangeTests_ or Back

nfc_NfcWritableNdefNightlyTests__52840r2_tgt_gcc_nfct2_71f9__0336cc8a
Test Case Result Duration [s]
All PASSED ERROR FAILED MISSED IGNORED NOT_EXECUTED
2 0 0 0 0 0 2
test_1_nfc_writable_ndef_message_0_url NOT_EXECUTED N/A  

Verdict message:

None
test_1_nfc_writable_ndef_message_1_empty NOT_EXECUTED N/A  

Verdict message:

None
Test Suite duration: N/A  
Go: NfcWritableNdefNightlyTests_ or Back

nfc_NfcWritableNdefNightlyTests__5340r1app_tgt_gcc_nfct2_6179__99f47a86
Test Case Result Duration [s]
All PASSED ERROR FAILED MISSED IGNORED NOT_EXECUTED
2 0 0 0 0 0 2
test_1_nfc_writable_ndef_message_0_url NOT_EXECUTED N/A  

Verdict message:

None
test_1_nfc_writable_ndef_message_1_empty NOT_EXECUTED N/A  

Verdict message:

None
Test Suite duration: N/A  
Go: NfcWritableNdefNightlyTests_ or Back

nfc_NfcWritableNdefNightlyTests__54l15app_tgt_gcc_nfct2_a53a__e51617bc
Test Case Result Duration [s]
All PASSED ERROR FAILED MISSED IGNORED NOT_EXECUTED
2 0 0 0 0 0 2
test_1_nfc_writable_ndef_message_0_url NOT_EXECUTED N/A  

Verdict message:

None
test_1_nfc_writable_ndef_message_1_empty NOT_EXECUTED N/A  

Verdict message:

None
Test Suite duration: N/A  
Go: NfcWritableNdefNightlyTests_ or Back

nfc_NfcWritableNdefTests__52840r2_tgt_gcc_nfct2_71f9__0336cc8a
Test Case Result Duration [s]
All PASSED ERROR FAILED MISSED IGNORED NOT_EXECUTED
1 0 0 0 0 0 1
test_1_nfc_writable_ndef_message_0_special_characters NOT_EXECUTED N/A  

Verdict message:

None
Test Suite duration: N/A  
Go: NfcWritableNdefTests_ or Back

nrf5340audio_mono_FuncMonoSmoketest_digi_h1_fwd_bis_debug_5340adk_tgt_none_4a53__cb0e5a44
Test Case Result Duration [s]
All PASSED ERROR FAILED MISSED IGNORED NOT_EXECUTED
1 0 0 0 0 0 1
test_audio_rms_level NOT_EXECUTED N/A  

Verdict message:

None
Test Suite duration: N/A  
Go: mono_FuncMonoSmoketest_digi_h1_fwd_bis_debug or Back

nrf5340audio_stereo_OncommitStereoTest_digi_fwd_cis_5340adk_tgt_none_4a53__5388a366
Test Case Result Duration [s]
All PASSED ERROR FAILED MISSED IGNORED NOT_EXECUTED
1 0 0 0 0 0 1
test_volume_control_short NOT_EXECUTED N/A  

Verdict message:

None
Test Suite duration: N/A  
Go: stereo_OncommitStereoTest_digi_fwd_cis or Back

nrf_provisioning_TestSLMIntegration_NativeTLS_1_9160r2ns_tgt_zephyr_8ff1
Test Case Result Duration [s]
All PASSED ERROR FAILED MISSED IGNORED NOT_EXECUTED
2 1 0 0 0 0 1
test_01_offline_services_generic_at_commands NOT_EXECUTED N/A  

Verdict message:

None
Test Suite duration: N/A  
Go: provisioning_TestSLMIntegration_NativeTLS_1 or Back

nrf_provisioning_TestSLMIntegration_NativeTLS_9160r2ns_tgt_zephyr_8ff1
Test Case Result Duration [s]
All PASSED ERROR FAILED MISSED IGNORED NOT_EXECUTED
2 1 0 0 0 0 1
test_01_offline_services_generic_at_commands NOT_EXECUTED N/A  

Verdict message:

None
Test Suite duration: N/A  
Go: provisioning_TestSLMIntegration_NativeTLS or Back

Nonfunctional Tests


nfc_NfcReliabilityBusySimulatorT2Tests__52840r2_tgt_gcc_nfct2_71f9__0336cc8a
Test Case Result Duration [s]
All PASSED ERROR FAILED MISSED IGNORED NOT_EXECUTED
1 0 0 0 0 0 1
test_1_T2_reading_with_busy_simulator NOT_EXECUTED N/A  

Verdict message:

None
Test Suite duration: N/A  
Go: NfcReliabilityBusySimulatorT2Tests_ or Back

nfc_NfcReliabilityBusySimulatorT2Tests__5340r1app_tgt_gcc_nfct2_6179__99f47a86
Test Case Result Duration [s]
All PASSED ERROR FAILED MISSED IGNORED NOT_EXECUTED
1 0 0 0 0 0 1
test_1_T2_reading_with_busy_simulator NOT_EXECUTED N/A  

Verdict message:

None
Test Suite duration: N/A  
Go: NfcReliabilityBusySimulatorT2Tests_ or Back

nfc_NfcReliabilityBusySimulatorT2Tests__54l15app_tgt_gcc_nfct2_a53a__e51617bc
Test Case Result Duration [s]
All PASSED ERROR FAILED MISSED IGNORED NOT_EXECUTED
1 0 0 0 0 0 1
test_1_T2_reading_with_busy_simulator NOT_EXECUTED N/A  

Verdict message:

None
Test Suite duration: N/A  
Go: NfcReliabilityBusySimulatorT2Tests_ or Back

nfc_NfcReliabilityBusySimulatorT4Tests__52840r2_tgt_gcc_nfct2_71f9__0336cc8a
Test Case Result Duration [s]
All PASSED ERROR FAILED MISSED IGNORED NOT_EXECUTED
1 0 0 0 0 0 1
test_1_T4_reading_with_busy_simulator NOT_EXECUTED N/A  

Verdict message:

None
Test Suite duration: N/A  
Go: NfcReliabilityBusySimulatorT4Tests_ or Back

nfc_NfcReliabilityBusySimulatorT4Tests__5340r1app_tgt_gcc_nfct2_6179__99f47a86
Test Case Result Duration [s]
All PASSED ERROR FAILED MISSED IGNORED NOT_EXECUTED
1 0 0 0 0 0 1
test_1_T4_reading_with_busy_simulator NOT_EXECUTED N/A  

Verdict message:

None
Test Suite duration: N/A  
Go: NfcReliabilityBusySimulatorT4Tests_ or Back

nfc_NfcReliabilityBusySimulatorT4Tests__54l15app_tgt_gcc_nfct2_a53a__e51617bc
Test Case Result Duration [s]
All PASSED ERROR FAILED MISSED IGNORED NOT_EXECUTED
1 0 0 0 0 0 1
test_1_T4_reading_with_busy_simulator NOT_EXECUTED N/A  

Verdict message:

None
Test Suite duration: N/A  
Go: NfcReliabilityBusySimulatorT4Tests_ or Back

nfc_NfcReliabilityTests__52840r2_tgt_gcc_nfct2_71f9__0336cc8a
Test Case Result Duration [s]
All PASSED ERROR FAILED MISSED IGNORED NOT_EXECUTED
2 0 0 0 0 0 2
test_1_tag_reading NOT_EXECUTED N/A  

Verdict message:

None
test_2_tag_read_with_fail NOT_EXECUTED N/A  

Verdict message:

None
Test Suite duration: N/A  
Go: NfcReliabilityTests_ or Back

nfc_NfcReliabilityTests__5340r1app_tgt_gcc_nfct2_6179__99f47a86
Test Case Result Duration [s]
All PASSED ERROR FAILED MISSED IGNORED NOT_EXECUTED
2 0 0 0 0 0 2
test_1_tag_reading NOT_EXECUTED N/A  

Verdict message:

None
test_2_tag_read_with_fail NOT_EXECUTED N/A  

Verdict message:

None
Test Suite duration: N/A  
Go: NfcReliabilityTests_ or Back

nfc_NfcReliabilityTests__54l15app_tgt_gcc_nfct2_a53a__e51617bc
Test Case Result Duration [s]
All PASSED ERROR FAILED MISSED IGNORED NOT_EXECUTED
2 0 0 0 0 0 2
test_1_tag_reading NOT_EXECUTED N/A  

Verdict message:

None
test_2_tag_read_with_fail NOT_EXECUTED N/A  

Verdict message:

None
Test Suite duration: N/A  
Go: NfcReliabilityTests_ or Back

nfc_NfcReliabilityWriteTests__52840r2_tgt_gcc_nfct2_71f9__0336cc8a
Test Case Result Duration [s]
All PASSED ERROR FAILED MISSED IGNORED NOT_EXECUTED
1 0 0 0 0 0 1
test_1_tag_read_write NOT_EXECUTED N/A  

Verdict message:

None
Test Suite duration: N/A  
Go: NfcReliabilityWriteTests_ or Back

nfc_NfcReliabilityWriteTests__5340r1app_tgt_gcc_nfct2_6179__99f47a86
Test Case Result Duration [s]
All PASSED ERROR FAILED MISSED IGNORED NOT_EXECUTED
1 0 0 0 0 0 1
test_1_tag_read_write NOT_EXECUTED N/A  

Verdict message:

None
Test Suite duration: N/A  
Go: NfcReliabilityWriteTests_ or Back

nfc_NfcReliabilityWriteTests__54l15app_tgt_gcc_nfct2_a53a__e51617bc
Test Case Result Duration [s]
All PASSED ERROR FAILED MISSED IGNORED NOT_EXECUTED
1 0 0 0 0 0 1
test_1_tag_read_write NOT_EXECUTED N/A  

Verdict message:

None
Test Suite duration: N/A  
Go: NfcReliabilityWriteTests_ or Back


All Test Results

Interface Tests

None

Functional Tests


LibmodemLteNone_TestCiphersuitesSample_9160r2ns_tgt_gcc_f5a4
9160r2ns_tgt_gcc_f5a4
Test Case Result Duration [s]
All PASSED ERROR FAILED MISSED IGNORED NOT_EXECUTED
1 1 0 0 0 0 0
test_ciphersuites_sample PASSED 16.34  
Test Suite duration: N/A  
Go: TestCiphersuitesSample or Back

LibmodemLteNone_TestCiphersuitesSample_9161fns_tgt_gcc_dc93
9161fns_tgt_gcc_dc93
Test Case Result Duration [s]
All PASSED ERROR FAILED MISSED IGNORED NOT_EXECUTED
1 1 0 0 0 0 0
test_ciphersuites_sample PASSED 297.32  
Test Suite duration: N/A  
Go: TestCiphersuitesSample or Back

LibmodemLteNone_TestLibmodemInitShutdownOffload_9160r2ns_tgt_gcc_f5a4
9160r2ns_tgt_gcc_f5a4
Test Case Result Duration [s]
All PASSED ERROR FAILED MISSED IGNORED NOT_EXECUTED
4 4 0 0 0 0 0
test_nrf_modem_lib_init_shutdown PASSED 0.00  
test_nrf_modem_lib_init_NORMAL_MODE_shutdown PASSED 0.00  
test_nrf_modem_lib_init_BOOTLOADER_MODE_shutdown PASSED 0.00  
test_nrf_modem_lib_init_shutdown_DFU PASSED 0.00  
Test Suite duration: N/A  
Go: TestLibmodemInitShutdownOffload or Back

LibmodemLteNone_TestLibmodemMdmKeyMgmt_9160r2ns_tgt_gcc_f5a4
9160r2ns_tgt_gcc_f5a4
Test Case Result Duration [s]
All PASSED ERROR FAILED MISSED IGNORED NOT_EXECUTED
5 4 0 0 0 0 1
test_key_mgmt_write_read PASSED 0.00  
test_key_mgmt_exists PASSED 0.00  
test_key_mgmt_clear PASSED 0.00  
test_key_mgmt_large_cert NOT_EXECUTED 0.00  
test_key_mgmt_cmp PASSED 0.00  
Test Suite duration: N/A  
Go: TestLibmodemMdmKeyMgmt or Back

LibmodemLteNone_TestLibmodemOffload_9160r2ns_tgt_gcc_f5a4
9160r2ns_tgt_gcc_f5a4
Test Case Result Duration [s]
All PASSED ERROR FAILED MISSED IGNORED NOT_EXECUTED
10 10 0 0 0 0 0
test_getaddrinfo_pdn_EAI_NONAME_inv PASSED 0.00  
test_nrf_send_pdn_udp_ipv4 PASSED 0.00  
test_nrf_send_pdn_udp_ipv6 PASSED 0.00  
test_nrf_send_pdn_tcp_ipv4 PASSED 0.00  
test_nrf_send_pdn_tcp_ipv6 PASSED 0.00  
test_pdn_ctx_configure_long_apn_name PASSED 0.00  
test_pdn_send_multi PASSED 0.00  
test_pdn_bind_default PASSED 0.00  
test_multi_thread_pdn_udp PASSED 0.00  
test_multi_thread_pdn_tcp PASSED 0.00  
Test Suite duration: N/A  
Go: TestLibmodemOffload or Back

LibmodemLteNone_TestModemCallbacksSample_9160r2ns_tgt_gcc_f5a4
9160r2ns_tgt_gcc_f5a4
Test Case Result Duration [s]
All PASSED ERROR FAILED MISSED IGNORED NOT_EXECUTED
1 1 0 0 0 0 0
test_modem_callbacks_sample PASSED 10.47  
Test Suite duration: N/A  
Go: TestModemCallbacksSample or Back

LibmodemLteNone_TestModemCallbacksSample_9161fns_tgt_gcc_dc93
9161fns_tgt_gcc_dc93
Test Case Result Duration [s]
All PASSED ERROR FAILED MISSED IGNORED NOT_EXECUTED
1 1 0 0 0 0 0
test_modem_callbacks_sample PASSED 6.26  
Test Suite duration: N/A  
Go: TestModemCallbacksSample or Back

LibmodemLteNone_TestModemTraceBackendSample_9160r2ns_tgt_gcc_f5a4
9160r2ns_tgt_gcc_f5a4
Test Case Result Duration [s]
All PASSED ERROR FAILED MISSED IGNORED NOT_EXECUTED
1 1 0 0 0 0 0
test_modem_trace_backend_sample PASSED 12.29  
Test Suite duration: N/A  
Go: TestModemTraceBackendSample or Back

LibmodemLteNone_TestModemTraceBackendSample_9161fns_tgt_gcc_dc93
9161fns_tgt_gcc_dc93
Test Case Result Duration [s]
All PASSED ERROR FAILED MISSED IGNORED NOT_EXECUTED
1 1 0 0 0 0 0
test_modem_trace_backend_sample PASSED 10.22  
Test Suite duration: N/A  
Go: TestModemTraceBackendSample or Back

LibmodemLteNone_TestPDNSample_9160r2ns_tgt_gcc_f5a4
9160r2ns_tgt_gcc_f5a4
Test Case Result Duration [s]
All PASSED ERROR FAILED MISSED IGNORED NOT_EXECUTED
1 1 0 0 0 0 0
test_pdn_sample PASSED 10.61  
Test Suite duration: N/A  
Go: TestPDNSample or Back

LibmodemLteNone_TestPDNSample_9161fns_tgt_gcc_dc93
9161fns_tgt_gcc_dc93
Test Case Result Duration [s]
All PASSED ERROR FAILED MISSED IGNORED NOT_EXECUTED
1 1 0 0 0 0 0
test_pdn_sample PASSED 8.52  
Test Suite duration: N/A  
Go: TestPDNSample or Back

LibmodemLtemNbiot_TestLibmodemIPOffload_9160r2ns_tgt_gcc_ltem_3005
9160r2ns_tgt_gcc_ltem_3005
Test Case Result Duration [s]
All PASSED ERROR FAILED MISSED IGNORED NOT_EXECUTED
32 32 0 0 0 0 0
test_offload_send_recv_poll_tcp_ipv4 PASSED 0.00  
test_offload_send_recv_poll_udp_ipv4 PASSED 0.00  
test_offload_socket_multi_tcp_ipv4 PASSED 0.00  
test_offload_getaddrinfo_ip PASSED 0.00  
test_offload_getaddrinfo_hostname PASSED 0.00  
test_offload_getaddrinfo_free PASSED 0.00  
test_offload_getaddrinfo_hints_is_NULL PASSED 0.00  
test_offload_sendmsg_ipv4_udp PASSED 0.00  
test_offload_sendmsg_ipv4_tcp PASSED 0.00  
test_offload_fcntl_blocking_ipv4_udp PASSED 0.00  
test_offload_fcntl_flags_ipv4_udp PASSED 0.00  
test_offload_fcntl_dup_fd_ipv4 PASSED 0.00  
test_offload_send_recv_poll_tcp_ipv6 PASSED 0.00  
test_offload_send_recv_poll_udp_ipv6 PASSED 0.00  
test_offload_getaddrinfo_ipv6 PASSED 0.00  
test_offload_getaddrinfo_hostname_ipv6 PASSED 0.00  
test_offload_sendmsg_ipv6_udp PASSED 0.00  
test_offload_sendmsg_ipv6_tcp PASSED 0.00  
test_offload_fcntl_blocking_ipv6_tcp PASSED 0.00  
test_offload_fcntl_flags_ipv6_tcp PASSED 0.00  
test_poll_pollnval PASSED 0.00  
test_poll_tcp_pollin_timeout PASSED 0.00  
test_poll_tcp_pollout_none PASSED 0.00  
test_poll_tcp_pollout PASSED 0.00  
test_poll_tcp_pollout_nonblock PASSED 0.00  
test_poll_udp_pollin_timeout PASSED 0.00  
test_poll_udp_pollout PASSED 0.00  
test_poll_eventfd_pollin PASSED 0.00  
test_poll_eventfd_pollin_timeout PASSED 0.00  
test_poll_eventfd_pollout PASSED 0.00  
test_poll_udp_eventfd PASSED 0.00  
test_concurrent_offload_send_recv PASSED 0.00  
Test Suite duration: N/A  
Go: TestLibmodemIPOffload or Back

LteNone_TestMultiServiceSample_1__0_9160r2ns_tgt_gcc_f5a4
9160r2ns_tgt_gcc_f5a4
Test Case Result Duration [s]
All PASSED ERROR FAILED MISSED IGNORED NOT_EXECUTED
3 3 0 0 0 0 0
test_multi_service_sample_coap_no_gnss PASSED 259.81  
test_multi_service_sample_no_gnss PASSED 77.73  
test_multi_service_sample_pgps_ext PASSED 120.99  
Test Suite duration: N/A  
Go: TestMultiServiceSample_1__0 or Back

LteNone_TestNrfCloudRestCellLocationSample_1__0_9160r2ns_tgt_gcc_f5a4
9160r2ns_tgt_gcc_f5a4
Test Case Result Duration [s]
All PASSED ERROR FAILED MISSED IGNORED NOT_EXECUTED
1 1 0 0 0 0 0
test_nrf_cloud_rest_cell_location_sample_default PASSED 98.75  
Test Suite duration: N/A  
Go: TestNrfCloudRestCellLocationSample_1__0 or Back

LteNone_TestNrfCloudRestDeviceMessageSample_1__0_9160r2ns_tgt_gcc_f5a4
9160r2ns_tgt_gcc_f5a4
Test Case Result Duration [s]
All PASSED ERROR FAILED MISSED IGNORED NOT_EXECUTED
1 1 0 0 0 0 0
test_nrf_cloud_rest_device_message_sample_default PASSED 99.84  
Test Suite duration: N/A  
Go: TestNrfCloudRestDeviceMessageSample_1__0 or Back

LteNone_TestNrfCloudRestFotaSample_2__0_9160r2ns_tgt_gcc_f5a4
9160r2ns_tgt_gcc_f5a4
Test Case Result Duration [s]
All PASSED ERROR FAILED MISSED IGNORED NOT_EXECUTED
1 1 0 0 0 0 0
test_nrf_cloud_rest_fota_sample_delta PASSED 319.19  
Test Suite duration: N/A  
Go: TestNrfCloudRestFotaSample_2__0 or Back

WiFi_7002DK_RadioTest__24G_11ax20_7002DK_tgt_none_280e__ASUS_RTAX88U_none_1cd6
7002DK_tgt_none_280e__ASUS_RTAX88U_none_1cd6
Test Case Result Duration [s]
All PASSED ERROR FAILED MISSED IGNORED NOT_EXECUTED
2 2 0 0 0 0 0
test_wifi_radio_rx PASSED 41.50  
test_wifi_radio_tx PASSED 38.07  
Test Suite duration: N/A  
Go: 7002DK_RadioTest__24G_11ax20 or Back

WiFi_7002DK_RadioTest__5G_11ax20_7002DK_tgt_none_280e__ASUS_RTAX88U_none_1cd6
7002DK_tgt_none_280e__ASUS_RTAX88U_none_1cd6
Test Case Result Duration [s]
All PASSED ERROR FAILED MISSED IGNORED NOT_EXECUTED
2 2 0 0 0 0 0
test_wifi_radio_rx PASSED 41.50  
test_wifi_radio_tx PASSED 40.22  
Test Suite duration: N/A  
Go: 7002DK_RadioTest__5G_11ax20 or Back

WiFi_7002DK_ScanSampleTest_7002DK_tgt_none_280e__ASUS_RTAX88U_none_1cd6
7002DK_tgt_none_280e__ASUS_RTAX88U_none_1cd6
Test Case Result Duration [s]
All PASSED ERROR FAILED MISSED IGNORED NOT_EXECUTED
1 1 0 0 0 0 0
test_scan_sample PASSED 50.13  
Test Suite duration: N/A  
Go: 7002DK_ScanSampleTest or Back

WiFi_7002DK_ShellSample__wpa3sae_7002DK_tgt_none_280e__ASUS_RTAX88U_none_1cd6
7002DK_tgt_none_280e__ASUS_RTAX88U_none_1cd6
Test Case Result Duration [s]
All PASSED ERROR FAILED MISSED IGNORED NOT_EXECUTED
2 2 0 0 0 0 0
test_connect__24G_11ax20 PASSED 196.64  
test_connect__5G_11ax20 PASSED 197.65  
Test Suite duration: N/A  
Go: 7002DK_ShellSample__wpa3sae or Back

WiFi_7002DK_TxInjectionSampleTest__24G_11ax20__wpa2psk_7002DK_tgt_none_280e__ASUS_RTAX88U_none_1cd6
7002DK_tgt_none_280e__ASUS_RTAX88U_none_1cd6
Test Case Result Duration [s]
All PASSED ERROR FAILED MISSED IGNORED NOT_EXECUTED
1 1 0 0 0 0 0
test_wifi_tx_injection_sample PASSED 129.69  
Test Suite duration: N/A  
Go: 7002DK_TxInjectionSampleTest__24G_11ax20__wpa2psk or Back

WiFi_7002DK_TxInjectionSampleTest__5G_11ax20__wpa2psk_7002DK_tgt_none_280e__ASUS_RTAX88U_none_1cd6
7002DK_tgt_none_280e__ASUS_RTAX88U_none_1cd6
Test Case Result Duration [s]
All PASSED ERROR FAILED MISSED IGNORED NOT_EXECUTED
1 1 0 0 0 0 0
test_wifi_tx_injection_sample PASSED 129.67  
Test Suite duration: N/A  
Go: 7002DK_TxInjectionSampleTest__5G_11ax20__wpa2psk or Back

ble_mesh_model_LightCtrlTest_52840r2_tgt_gcc_sdc_f59b__b76774ee
52840r2_tgt_gcc_sdc_f59b__b76774ee
Test Case Result Duration [s]
All PASSED ERROR FAILED MISSED IGNORED NOT_EXECUTED
1 0 0 0 0 0 1
test_scene_storage NOT_EXECUTED N/A  
Test Suite duration: N/A  
Go: mesh_model_LightCtrlTest or Back

ble_mesh_model_LightCtrlTest_52bsim_bsim_gcc_sdc_650b__52bsim_gcc_sdc_7251
52bsim_bsim_gcc_sdc_650b__52bsim_gcc_sdc_7251
Test Case Result Duration [s]
All PASSED ERROR FAILED MISSED IGNORED NOT_EXECUTED
1 0 0 0 0 0 1
test_scene_storage NOT_EXECUTED N/A  
Test Suite duration: N/A  
Go: mesh_model_LightCtrlTest or Back

ble_mesh_model_LightCtrlTest_5340_tgt_gcc_sdc_cef5__2df0d355
5340_tgt_gcc_sdc_cef5__2df0d355
Test Case Result Duration [s]
All PASSED ERROR FAILED MISSED IGNORED NOT_EXECUTED
1 0 0 0 0 0 1
test_scene_storage NOT_EXECUTED N/A  
Test Suite duration: N/A  
Go: mesh_model_LightCtrlTest or Back

ble_mesh_model_LightCtrlTest_5340app_ns_tgt_gcc_sdc_43cc__6a35b764
5340app_ns_tgt_gcc_sdc_43cc__6a35b764
Test Case Result Duration [s]
All PASSED ERROR FAILED MISSED IGNORED NOT_EXECUTED
1 0 0 0 0 0 1
test_scene_storage NOT_EXECUTED N/A  
Test Suite duration: N/A  
Go: mesh_model_LightCtrlTest or Back

ble_mesh_model_LightCtrlTest_54l15app_tgt_gcc_sdc_6f23__c847677b
54l15app_tgt_gcc_sdc_6f23__c847677b
Test Case Result Duration [s]
All PASSED ERROR FAILED MISSED IGNORED NOT_EXECUTED
1 0 0 0 0 0 1
test_scene_storage NOT_EXECUTED N/A  
Test Suite duration: N/A  
Go: mesh_model_LightCtrlTest or Back

ble_mesh_samples_MeshLightCtrlSample_52840r3_tgt_gcc_sdc_7bad__52840r3_gcc_sdc_c6d0
52840r3_tgt_gcc_sdc_7bad__52840r3_gcc_sdc_c6d0
Test Case Result Duration [s]
All PASSED ERROR FAILED MISSED IGNORED NOT_EXECUTED
1 1 0 0 0 0 0
test_light_ctrl PASSED 8.44  
Test Suite duration: N/A  
Go: mesh_samples_MeshLightCtrlSample or Back

ble_mesh_samples_MeshLightCtrlSample_5340_tgt_gcc_sdc_cef5__52840r3_gcc_sdc_c6d0
5340_tgt_gcc_sdc_cef5__52840r3_gcc_sdc_c6d0
Test Case Result Duration [s]
All PASSED ERROR FAILED MISSED IGNORED NOT_EXECUTED
1 1 0 0 0 0 0
test_light_ctrl PASSED 8.95  
Test Suite duration: N/A  
Go: mesh_samples_MeshLightCtrlSample or Back

ble_mesh_samples_MeshLightCtrlSample_5340app_ns_tgt_gcc_sdc_43cc__52840r3_gcc_sdc_c6d0
5340app_ns_tgt_gcc_sdc_43cc__52840r3_gcc_sdc_c6d0
Test Case Result Duration [s]
All PASSED ERROR FAILED MISSED IGNORED NOT_EXECUTED
1 1 0 0 0 0 0
test_light_ctrl PASSED 8.83  
Test Suite duration: N/A  
Go: mesh_samples_MeshLightCtrlSample or Back

ble_mesh_samples_MeshLightCtrlSample_54l15app_tgt_gcc_sdc_6f23__52840r3_gcc_sdc_c6d0
54l15app_tgt_gcc_sdc_6f23__52840r3_gcc_sdc_c6d0
Test Case Result Duration [s]
All PASSED ERROR FAILED MISSED IGNORED NOT_EXECUTED
1 1 0 0 0 0 0
test_light_ctrl PASSED 7.57  
Test Suite duration: N/A  
Go: mesh_samples_MeshLightCtrlSample or Back

ble_mesh_samples_MeshLightDfuSample_52840r3_tgt_gcc_sdc_7bad__52840r3_gcc_sdc_c6d0
52840r3_tgt_gcc_sdc_7bad__52840r3_gcc_sdc_c6d0
Test Case Result Duration [s]
All PASSED ERROR FAILED MISSED IGNORED NOT_EXECUTED
1 1 0 0 0 0 0
test_light_provision_pb_gatt PASSED 8.39  
Test Suite duration: N/A  
Go: mesh_samples_MeshLightDfuSample or Back

ble_mesh_samples_MeshLightDfuSample_5340_tgt_gcc_sdc_cef5__52840r3_gcc_sdc_c6d0
5340_tgt_gcc_sdc_cef5__52840r3_gcc_sdc_c6d0
Test Case Result Duration [s]
All PASSED ERROR FAILED MISSED IGNORED NOT_EXECUTED
1 0 0 0 0 1 0
test_light_provision_pb_gatt IGNORED N/A  

Verdict message: DISABLED, DFU overlay is not supported for nRF5340dk, NCSDK-29097

Test Suite duration: N/A  
Go: mesh_samples_MeshLightDfuSample or Back

ble_mesh_samples_MeshLightDfuSample_5340app_ns_tgt_gcc_sdc_43cc__52840r3_gcc_sdc_c6d0
5340app_ns_tgt_gcc_sdc_43cc__52840r3_gcc_sdc_c6d0
Test Case Result Duration [s]
All PASSED ERROR FAILED MISSED IGNORED NOT_EXECUTED
1 0 0 0 0 1 0
test_light_provision_pb_gatt IGNORED N/A  

Verdict message: DISABLED, DFU overlay is not supported for nRF5340dk, NCSDK-29097

Test Suite duration: N/A  
Go: mesh_samples_MeshLightDfuSample or Back

ble_mesh_samples_MeshLightDfuSample_54l15app_tgt_gcc_sdc_6f23__52840r3_gcc_sdc_c6d0
54l15app_tgt_gcc_sdc_6f23__52840r3_gcc_sdc_c6d0
Test Case Result Duration [s]
All PASSED ERROR FAILED MISSED IGNORED NOT_EXECUTED
1 0 0 0 0 1 0
test_light_provision_pb_gatt IGNORED N/A  

Verdict message: DISABLED, DFU overlay is not supported for nRF5340dk, NCSDK-29097

Test Suite duration: N/A  
Go: mesh_samples_MeshLightDfuSample or Back

ble_mesh_samples_MeshLightDimmerSample_52840r3_tgt_gcc_sdc_7bad__52840r3_gcc_sdc_c6d0
52840r3_tgt_gcc_sdc_7bad__52840r3_gcc_sdc_c6d0
Test Case Result Duration [s]
All PASSED ERROR FAILED MISSED IGNORED NOT_EXECUTED
1 1 0 0 0 0 0
test_light_dimmer PASSED 21.02  
Test Suite duration: N/A  
Go: mesh_samples_MeshLightDimmerSample or Back

ble_mesh_samples_MeshLightDimmerSample_5340_tgt_gcc_sdc_cef5__52840r3_gcc_sdc_c6d0
5340_tgt_gcc_sdc_cef5__52840r3_gcc_sdc_c6d0
Test Case Result Duration [s]
All PASSED ERROR FAILED MISSED IGNORED NOT_EXECUTED
1 1 0 0 0 0 0
test_light_dimmer PASSED 18.62  
Test Suite duration: N/A  
Go: mesh_samples_MeshLightDimmerSample or Back

ble_mesh_samples_MeshLightDimmerSample_5340app_ns_tgt_gcc_sdc_43cc__52840r3_gcc_sdc_c6d0
5340app_ns_tgt_gcc_sdc_43cc__52840r3_gcc_sdc_c6d0
Test Case Result Duration [s]
All PASSED ERROR FAILED MISSED IGNORED NOT_EXECUTED
1 1 0 0 0 0 0
test_light_dimmer PASSED 18.94  
Test Suite duration: N/A  
Go: mesh_samples_MeshLightDimmerSample or Back

ble_mesh_samples_MeshLightDimmerSample_54l15app_tgt_gcc_sdc_6f23__52840r3_gcc_sdc_c6d0
54l15app_tgt_gcc_sdc_6f23__52840r3_gcc_sdc_c6d0
Test Case Result Duration [s]
All PASSED ERROR FAILED MISSED IGNORED NOT_EXECUTED
1 1 0 0 0 0 0
test_light_dimmer PASSED 18.22  
Test Suite duration: N/A  
Go: mesh_samples_MeshLightDimmerSample or Back

ble_mesh_samples_MeshSensorServerSample_52840r3_tgt_gcc_sdc_7bad__52840r3_gcc_sdc_c6d0
52840r3_tgt_gcc_sdc_7bad__52840r3_gcc_sdc_c6d0
Test Case Result Duration [s]
All PASSED ERROR FAILED MISSED IGNORED NOT_EXECUTED
1 1 0 0 0 0 0
test_sensor PASSED 21.92  
Test Suite duration: N/A  
Go: mesh_samples_MeshSensorServerSample or Back

ble_mesh_samples_MeshSensorServerSample_5340_tgt_gcc_sdc_cef5__52840r3_gcc_sdc_c6d0
5340_tgt_gcc_sdc_cef5__52840r3_gcc_sdc_c6d0
Test Case Result Duration [s]
All PASSED ERROR FAILED MISSED IGNORED NOT_EXECUTED
1 0 0 0 0 1 0
test_sensor IGNORED N/A  

Verdict message: DISABLED, Sample is not supported for nRF5340dk

Test Suite duration: N/A  
Go: mesh_samples_MeshSensorServerSample or Back

ble_mesh_samples_MeshSensorServerSample_5340app_ns_tgt_gcc_sdc_43cc__52840r3_gcc_sdc_c6d0
5340app_ns_tgt_gcc_sdc_43cc__52840r3_gcc_sdc_c6d0
Test Case Result Duration [s]
All PASSED ERROR FAILED MISSED IGNORED NOT_EXECUTED
1 0 0 0 0 1 0
test_sensor IGNORED N/A  

Verdict message: DISABLED, Sample is not supported for nRF5340dk

Test Suite duration: N/A  
Go: mesh_samples_MeshSensorServerSample or Back

ble_mesh_samples_MeshSensorServerSample_54l15app_tgt_gcc_sdc_6f23__52840r3_gcc_sdc_c6d0
54l15app_tgt_gcc_sdc_6f23__52840r3_gcc_sdc_c6d0
Test Case Result Duration [s]
All PASSED ERROR FAILED MISSED IGNORED NOT_EXECUTED
1 1 0 0 0 0 0
test_sensor PASSED 18.45  
Test Suite duration: N/A  
Go: mesh_samples_MeshSensorServerSample or Back

ble_samples_newlib_TestSuiteHIDSMouse_52840r3_tgt_gcc_sdc_7bad__52840r3_gcc_sdc_c6d0
52840r3_tgt_gcc_sdc_7bad__52840r3_gcc_sdc_c6d0
Test Case Result Duration [s]
All PASSED ERROR FAILED MISSED IGNORED NOT_EXECUTED
1 1 0 0 0 0 0
test_hids_mouse_sanity_test PASSED 32.74  
Test Suite duration: N/A  
Go: samples_newlib_TestSuiteHIDSMouse or Back

ble_samples_newlib_TestSuiteHIDSMouse_52840r3_tgt_gcc_sdc_newlib_3c3f__52840r3_gcc_sdc_newlib_c8f9
52840r3_tgt_gcc_sdc_newlib_3c3f__52840r3_gcc_sdc_newlib_c8f9
Test Case Result Duration [s]
All PASSED ERROR FAILED MISSED IGNORED NOT_EXECUTED
1 1 0 0 0 0 0
test_hids_mouse_sanity_test PASSED 32.73  
Test Suite duration: N/A  
Go: samples_newlib_TestSuiteHIDSMouse or Back

ble_samples_newlib_TestSuiteHIDSMouse_5340_tgt_0beb__5340_7874
5340_tgt_0beb__5340_7874
Test Case Result Duration [s]
All PASSED ERROR FAILED MISSED IGNORED NOT_EXECUTED
1 1 0 0 0 0 0
test_hids_mouse_sanity_test PASSED 34.90  
Test Suite duration: N/A  
Go: samples_newlib_TestSuiteHIDSMouse or Back

ble_samples_newlib_TestSuiteHIDSMouse_5340_tgt_bd10__5340_074d
5340_tgt_bd10__5340_074d
Test Case Result Duration [s]
All PASSED ERROR FAILED MISSED IGNORED NOT_EXECUTED
1 1 0 0 0 0 0
test_hids_mouse_sanity_test PASSED 34.99  
Test Suite duration: N/A  
Go: samples_newlib_TestSuiteHIDSMouse or Back

ble_samples_newlib_TestSuiteHIDSMouse_5340_tgt_gcc_rpc_c27b__5340_gcc_sdc_c180
5340_tgt_gcc_rpc_c27b__5340_gcc_sdc_c180
Test Case Result Duration [s]
All PASSED ERROR FAILED MISSED IGNORED NOT_EXECUTED
1 0 0 0 0 1 0
test_hids_mouse_sanity_test IGNORED N/A  

Verdict message: DISABLED, Disabled for comp_eagle, Disabled RPC conf (sysbuild issue?) NCSDK-29444

Test Suite duration: N/A  
Go: samples_newlib_TestSuiteHIDSMouse or Back

ble_samples_newlib_TestSuiteHIDSMouse_54h20fp1_tgt_gcc_sdc_1f1b__52840r3_gcc_sdc_e902
54h20fp1_tgt_gcc_sdc_1f1b__52840r3_gcc_sdc_e902
Test Case Result Duration [s]
All PASSED ERROR FAILED MISSED IGNORED NOT_EXECUTED
1 1 0 0 0 0 0
test_hids_mouse_sanity_test PASSED 33.47  
Test Suite duration: N/A  
Go: samples_newlib_TestSuiteHIDSMouse or Back

ble_samples_newlib_TestSuiteHIDSMouse_54l15app_tgt_gcc_sdc_6f23__54l15app_gcc_sdc_6551
54l15app_tgt_gcc_sdc_6f23__54l15app_gcc_sdc_6551
Test Case Result Duration [s]
All PASSED ERROR FAILED MISSED IGNORED NOT_EXECUTED
1 1 0 0 0 0 0
test_hids_mouse_sanity_test PASSED 32.45  
Test Suite duration: N/A  
Go: samples_newlib_TestSuiteHIDSMouse or Back

ble_samples_newlib_TestSuiteHIDSMouse_54lm20a_dk_tgt_gcc_sdc_3589__52840r3_gcc_sdc_e902
54lm20a_dk_tgt_gcc_sdc_3589__52840r3_gcc_sdc_e902
Test Case Result Duration [s]
All PASSED ERROR FAILED MISSED IGNORED NOT_EXECUTED
1 1 0 0 0 0 0
test_hids_mouse_sanity_test PASSED 31.89  
Test Suite duration: N/A  
Go: samples_newlib_TestSuiteHIDSMouse or Back

crypto_all_TestDtlsTargetClientEcdsa_5340r1app_ns_tgt_gcc_cc3xx_oberon_c236
5340r1app_ns_tgt_gcc_cc3xx_oberon_c236
Test Case Result Duration [s]
All PASSED ERROR FAILED MISSED IGNORED NOT_EXECUTED
5 0 0 0 0 0 5
test_host_server_target_client_ECDHE_ECDSA_AES128_CCM NOT_EXECUTED N/A  
test_host_server_target_client_ECDHE_ECDSA_AES256_CCM NOT_EXECUTED N/A  
test_host_server_target_client_ECDHE_ECDSA_AES256_GCM_SHA384 NOT_EXECUTED N/A  
test_host_server_target_client_ECDHE_PSK_AES128_CBC_SHA256 NOT_EXECUTED N/A  
test_host_server_target_client_ECDHE_PSK_CHACHA20_POLY1305 NOT_EXECUTED N/A  
Test Suite duration: N/A  
Go: all_TestDtlsTargetClientEcdsa or Back

crypto_all_TestDtlsTargetClientEcdsa_5340r1app_tgt_gcc_cc3xx_oberon_4bea
5340r1app_tgt_gcc_cc3xx_oberon_4bea
Test Case Result Duration [s]
All PASSED ERROR FAILED MISSED IGNORED NOT_EXECUTED
5 0 0 0 0 0 5
test_host_server_target_client_ECDHE_ECDSA_AES128_CCM NOT_EXECUTED N/A  
test_host_server_target_client_ECDHE_ECDSA_AES256_CCM NOT_EXECUTED N/A  
test_host_server_target_client_ECDHE_ECDSA_AES256_GCM_SHA384 NOT_EXECUTED N/A  
test_host_server_target_client_ECDHE_PSK_AES128_CBC_SHA256 NOT_EXECUTED N/A  
test_host_server_target_client_ECDHE_PSK_CHACHA20_POLY1305 NOT_EXECUTED N/A  
Test Suite duration: N/A  
Go: all_TestDtlsTargetClientEcdsa or Back

crypto_all_TestDtlsTargetClientEcdsa_54l15app_ns_tgt_gcc_cracen_8e7d
54l15app_ns_tgt_gcc_cracen_8e7d
Test Case Result Duration [s]
All PASSED ERROR FAILED MISSED IGNORED NOT_EXECUTED
5 0 0 0 0 0 5
test_host_server_target_client_ECDHE_ECDSA_AES128_CCM NOT_EXECUTED N/A  
test_host_server_target_client_ECDHE_ECDSA_AES256_CCM NOT_EXECUTED N/A  
test_host_server_target_client_ECDHE_ECDSA_AES256_GCM_SHA384 NOT_EXECUTED N/A  
test_host_server_target_client_ECDHE_PSK_AES128_CBC_SHA256 NOT_EXECUTED N/A  
test_host_server_target_client_ECDHE_PSK_CHACHA20_POLY1305 NOT_EXECUTED N/A  
Test Suite duration: N/A  
Go: all_TestDtlsTargetClientEcdsa or Back

crypto_all_TestDtlsTargetClientEcdsa_54l15app_tgt_gcc_cracen_6f87
54l15app_tgt_gcc_cracen_6f87
Test Case Result Duration [s]
All PASSED ERROR FAILED MISSED IGNORED NOT_EXECUTED
5 0 0 0 0 0 5
test_host_server_target_client_ECDHE_ECDSA_AES128_CCM NOT_EXECUTED N/A  
test_host_server_target_client_ECDHE_ECDSA_AES256_CCM NOT_EXECUTED N/A  
test_host_server_target_client_ECDHE_ECDSA_AES256_GCM_SHA384 NOT_EXECUTED N/A  
test_host_server_target_client_ECDHE_PSK_AES128_CBC_SHA256 NOT_EXECUTED N/A  
test_host_server_target_client_ECDHE_PSK_CHACHA20_POLY1305 NOT_EXECUTED N/A  
Test Suite duration: N/A  
Go: all_TestDtlsTargetClientEcdsa or Back

crypto_all_TestDtlsTargetServerEcdsaSecp384r1_54l15app_ns_tgt_gcc_cracen_8e7d
54l15app_ns_tgt_gcc_cracen_8e7d
Test Case Result Duration [s]
All PASSED ERROR FAILED MISSED IGNORED NOT_EXECUTED
5 0 0 0 0 0 5
test_host_client_target_server_ECDHE_ECDSA_AES128_CCM NOT_EXECUTED N/A  
test_host_client_target_server_ECDHE_ECDSA_AES256_CCM NOT_EXECUTED N/A  
test_host_client_target_server_ECDHE_ECDSA_AES256_GCM_SHA384 NOT_EXECUTED N/A  
test_host_client_target_server_ECDHE_PSK_AES128_CBC_SHA256 NOT_EXECUTED N/A  
test_host_client_target_server_ECDHE_PSK_CHACHA20_POLY1305 NOT_EXECUTED N/A  
Test Suite duration: N/A  
Go: all_TestDtlsTargetServerEcdsaSecp384r1 or Back

crypto_all_TestDtlsTargetServerEcdsaSecp384r1_54l15app_tgt_gcc_cracen_6f87
54l15app_tgt_gcc_cracen_6f87
Test Case Result Duration [s]
All PASSED ERROR FAILED MISSED IGNORED NOT_EXECUTED
5 0 0 0 0 0 5
test_host_client_target_server_ECDHE_ECDSA_AES128_CCM NOT_EXECUTED N/A  
test_host_client_target_server_ECDHE_ECDSA_AES256_CCM NOT_EXECUTED N/A  
test_host_client_target_server_ECDHE_ECDSA_AES256_GCM_SHA384 NOT_EXECUTED N/A  
test_host_client_target_server_ECDHE_PSK_AES128_CBC_SHA256 NOT_EXECUTED N/A  
test_host_client_target_server_ECDHE_PSK_CHACHA20_POLY1305 NOT_EXECUTED N/A  
Test Suite duration: N/A  
Go: all_TestDtlsTargetServerEcdsaSecp384r1 or Back

crypto_all_TestDtlsTargetServerEcdsa_5340r1app_ns_tgt_gcc_cc3xx_oberon_c236
5340r1app_ns_tgt_gcc_cc3xx_oberon_c236
Test Case Result Duration [s]
All PASSED ERROR FAILED MISSED IGNORED NOT_EXECUTED
5 0 0 0 0 0 5
test_host_client_target_server_ECDHE_ECDSA_AES128_CCM NOT_EXECUTED N/A  
test_host_client_target_server_ECDHE_ECDSA_AES256_CCM NOT_EXECUTED N/A  
test_host_client_target_server_ECDHE_ECDSA_AES256_GCM_SHA384 NOT_EXECUTED N/A  
test_host_client_target_server_ECDHE_PSK_AES128_CBC_SHA256 NOT_EXECUTED N/A  
test_host_client_target_server_ECDHE_PSK_CHACHA20_POLY1305 NOT_EXECUTED N/A  
Test Suite duration: N/A  
Go: all_TestDtlsTargetServerEcdsa or Back

crypto_all_TestDtlsTargetServerEcdsa_5340r1app_tgt_gcc_cc3xx_oberon_4bea
5340r1app_tgt_gcc_cc3xx_oberon_4bea
Test Case Result Duration [s]
All PASSED ERROR FAILED MISSED IGNORED NOT_EXECUTED
5 0 0 0 0 0 5
test_host_client_target_server_ECDHE_ECDSA_AES128_CCM NOT_EXECUTED N/A  
test_host_client_target_server_ECDHE_ECDSA_AES256_CCM NOT_EXECUTED N/A  
test_host_client_target_server_ECDHE_ECDSA_AES256_GCM_SHA384 NOT_EXECUTED N/A  
test_host_client_target_server_ECDHE_PSK_AES128_CBC_SHA256 NOT_EXECUTED N/A  
test_host_client_target_server_ECDHE_PSK_CHACHA20_POLY1305 NOT_EXECUTED N/A  
Test Suite duration: N/A  
Go: all_TestDtlsTargetServerEcdsa or Back

crypto_all_TestDtlsTargetServerEcdsa_54l15app_ns_tgt_gcc_cracen_8e7d
54l15app_ns_tgt_gcc_cracen_8e7d
Test Case Result Duration [s]
All PASSED ERROR FAILED MISSED IGNORED NOT_EXECUTED
5 0 0 0 0 0 5
test_host_client_target_server_ECDHE_ECDSA_AES128_CCM NOT_EXECUTED N/A  
test_host_client_target_server_ECDHE_ECDSA_AES256_CCM NOT_EXECUTED N/A  
test_host_client_target_server_ECDHE_ECDSA_AES256_GCM_SHA384 NOT_EXECUTED N/A  
test_host_client_target_server_ECDHE_PSK_AES128_CBC_SHA256 NOT_EXECUTED N/A  
test_host_client_target_server_ECDHE_PSK_CHACHA20_POLY1305 NOT_EXECUTED N/A  
Test Suite duration: N/A  
Go: all_TestDtlsTargetServerEcdsa or Back

crypto_all_TestDtlsTargetServerEcdsa_54l15app_tgt_gcc_cracen_6f87
54l15app_tgt_gcc_cracen_6f87
Test Case Result Duration [s]
All PASSED ERROR FAILED MISSED IGNORED NOT_EXECUTED
5 0 0 0 0 0 5
test_host_client_target_server_ECDHE_ECDSA_AES128_CCM NOT_EXECUTED N/A  
test_host_client_target_server_ECDHE_ECDSA_AES256_CCM NOT_EXECUTED N/A  
test_host_client_target_server_ECDHE_ECDSA_AES256_GCM_SHA384 NOT_EXECUTED N/A  
test_host_client_target_server_ECDHE_PSK_AES128_CBC_SHA256 NOT_EXECUTED N/A  
test_host_client_target_server_ECDHE_PSK_CHACHA20_POLY1305 NOT_EXECUTED N/A  
Test Suite duration: N/A  
Go: all_TestDtlsTargetServerEcdsa or Back

crypto_all_TestTls13TargetClientEcdsa_5340r1app_ns_tgt_gcc_cc3xx_oberon_c236
5340r1app_ns_tgt_gcc_cc3xx_oberon_c236
Test Case Result Duration [s]
All PASSED ERROR FAILED MISSED IGNORED NOT_EXECUTED
5 0 0 0 0 0 5
test_host_server_target_client_TLS_AES_128_CCM_8_SHA256 NOT_EXECUTED N/A  
test_host_server_target_client_TLS_AES_128_CCM_SHA256 NOT_EXECUTED N/A  
test_host_server_target_client_TLS_AES_128_GCM_SHA256 NOT_EXECUTED N/A  
test_host_server_target_client_TLS_AES_256_GCM_SHA384 NOT_EXECUTED N/A  
test_host_server_target_client_TLS_CHACHA20_POLY1305_SHA256 NOT_EXECUTED N/A  
Test Suite duration: N/A  
Go: all_TestTls13TargetClientEcdsa or Back

crypto_all_TestTls13TargetClientEcdsa_5340r1app_tgt_gcc_cc3xx_oberon_4bea
5340r1app_tgt_gcc_cc3xx_oberon_4bea
Test Case Result Duration [s]
All PASSED ERROR FAILED MISSED IGNORED NOT_EXECUTED
5 0 0 0 0 0 5
test_host_server_target_client_TLS_AES_128_CCM_8_SHA256 NOT_EXECUTED N/A  
test_host_server_target_client_TLS_AES_128_CCM_SHA256 NOT_EXECUTED N/A  
test_host_server_target_client_TLS_AES_128_GCM_SHA256 NOT_EXECUTED N/A  
test_host_server_target_client_TLS_AES_256_GCM_SHA384 NOT_EXECUTED N/A  
test_host_server_target_client_TLS_CHACHA20_POLY1305_SHA256 NOT_EXECUTED N/A  
Test Suite duration: N/A  
Go: all_TestTls13TargetClientEcdsa or Back

crypto_all_TestTls13TargetClientEcdsa_54l15app_ns_tgt_gcc_cracen_8e7d
54l15app_ns_tgt_gcc_cracen_8e7d
Test Case Result Duration [s]
All PASSED ERROR FAILED MISSED IGNORED NOT_EXECUTED
5 0 0 0 0 0 5
test_host_server_target_client_TLS_AES_128_CCM_8_SHA256 NOT_EXECUTED N/A  
test_host_server_target_client_TLS_AES_128_CCM_SHA256 NOT_EXECUTED N/A  
test_host_server_target_client_TLS_AES_128_GCM_SHA256 NOT_EXECUTED N/A  
test_host_server_target_client_TLS_AES_256_GCM_SHA384 NOT_EXECUTED N/A  
test_host_server_target_client_TLS_CHACHA20_POLY1305_SHA256 NOT_EXECUTED N/A  
Test Suite duration: N/A  
Go: all_TestTls13TargetClientEcdsa or Back

crypto_all_TestTls13TargetClientEcdsa_54l15app_tgt_gcc_cracen_6f87
54l15app_tgt_gcc_cracen_6f87
Test Case Result Duration [s]
All PASSED ERROR FAILED MISSED IGNORED NOT_EXECUTED
5 0 0 0 0 0 5
test_host_server_target_client_TLS_AES_128_CCM_8_SHA256 NOT_EXECUTED N/A  
test_host_server_target_client_TLS_AES_128_CCM_SHA256 NOT_EXECUTED N/A  
test_host_server_target_client_TLS_AES_128_GCM_SHA256 NOT_EXECUTED N/A  
test_host_server_target_client_TLS_AES_256_GCM_SHA384 NOT_EXECUTED N/A  
test_host_server_target_client_TLS_CHACHA20_POLY1305_SHA256 NOT_EXECUTED N/A  
Test Suite duration: N/A  
Go: all_TestTls13TargetClientEcdsa or Back

crypto_all_TestTls13TargetServerEcdsa_5340r1app_ns_tgt_gcc_cc3xx_oberon_c236
5340r1app_ns_tgt_gcc_cc3xx_oberon_c236
Test Case Result Duration [s]
All PASSED ERROR FAILED MISSED IGNORED NOT_EXECUTED
5 0 0 0 0 0 5
test_host_client_target_server_TLS_AES_128_CCM_8_SHA256 NOT_EXECUTED N/A  
test_host_client_target_server_TLS_AES_128_CCM_SHA256 NOT_EXECUTED N/A  
test_host_client_target_server_TLS_AES_128_GCM_SHA256 NOT_EXECUTED N/A  
test_host_client_target_server_TLS_AES_256_GCM_SHA384 NOT_EXECUTED N/A  
test_host_client_target_server_TLS_CHACHA20_POLY1305_SHA256 NOT_EXECUTED N/A  
Test Suite duration: N/A  
Go: all_TestTls13TargetServerEcdsa or Back

crypto_all_TestTls13TargetServerEcdsa_5340r1app_tgt_gcc_cc3xx_oberon_4bea
5340r1app_tgt_gcc_cc3xx_oberon_4bea
Test Case Result Duration [s]
All PASSED ERROR FAILED MISSED IGNORED NOT_EXECUTED
5 0 0 0 0 0 5
test_host_client_target_server_TLS_AES_128_CCM_8_SHA256 NOT_EXECUTED N/A  
test_host_client_target_server_TLS_AES_128_CCM_SHA256 NOT_EXECUTED N/A  
test_host_client_target_server_TLS_AES_128_GCM_SHA256 NOT_EXECUTED N/A  
test_host_client_target_server_TLS_AES_256_GCM_SHA384 NOT_EXECUTED N/A  
test_host_client_target_server_TLS_CHACHA20_POLY1305_SHA256 NOT_EXECUTED N/A  
Test Suite duration: N/A  
Go: all_TestTls13TargetServerEcdsa or Back

crypto_all_TestTls13TargetServerEcdsa_54l15app_ns_tgt_gcc_cracen_8e7d
54l15app_ns_tgt_gcc_cracen_8e7d
Test Case Result Duration [s]
All PASSED ERROR FAILED MISSED IGNORED NOT_EXECUTED
5 0 0 0 0 0 5
test_host_client_target_server_TLS_AES_128_CCM_8_SHA256 NOT_EXECUTED N/A  
test_host_client_target_server_TLS_AES_128_CCM_SHA256 NOT_EXECUTED N/A  
test_host_client_target_server_TLS_AES_128_GCM_SHA256 NOT_EXECUTED N/A  
test_host_client_target_server_TLS_AES_256_GCM_SHA384 NOT_EXECUTED N/A  
test_host_client_target_server_TLS_CHACHA20_POLY1305_SHA256 NOT_EXECUTED N/A  
Test Suite duration: N/A  
Go: all_TestTls13TargetServerEcdsa or Back

crypto_all_TestTls13TargetServerEcdsa_54l15app_tgt_gcc_cracen_6f87
54l15app_tgt_gcc_cracen_6f87
Test Case Result Duration [s]
All PASSED ERROR FAILED MISSED IGNORED NOT_EXECUTED
5 0 0 0 0 0 5
test_host_client_target_server_TLS_AES_128_CCM_8_SHA256 NOT_EXECUTED N/A  
test_host_client_target_server_TLS_AES_128_CCM_SHA256 NOT_EXECUTED N/A  
test_host_client_target_server_TLS_AES_128_GCM_SHA256 NOT_EXECUTED N/A  
test_host_client_target_server_TLS_AES_256_GCM_SHA384 NOT_EXECUTED N/A  
test_host_client_target_server_TLS_CHACHA20_POLY1305_SHA256 NOT_EXECUTED N/A  
Test Suite duration: N/A  
Go: all_TestTls13TargetServerEcdsa or Back

crypto_all_TestTlsTargetClientEcdsa_5340r1app_ns_tgt_gcc_cc3xx_oberon_c236
5340r1app_ns_tgt_gcc_cc3xx_oberon_c236
Test Case Result Duration [s]
All PASSED ERROR FAILED MISSED IGNORED NOT_EXECUTED
5 0 0 0 0 0 5
test_host_server_target_client_ECDHE_ECDSA_AES128_CCM NOT_EXECUTED N/A  
test_host_server_target_client_ECDHE_ECDSA_AES256_CCM NOT_EXECUTED N/A  
test_host_server_target_client_ECDHE_ECDSA_AES256_GCM_SHA384 NOT_EXECUTED N/A  
test_host_server_target_client_ECDHE_PSK_AES128_CBC_SHA256 NOT_EXECUTED N/A  
test_host_server_target_client_ECDHE_PSK_CHACHA20_POLY1305 NOT_EXECUTED N/A  
Test Suite duration: N/A  
Go: all_TestTlsTargetClientEcdsa or Back

crypto_all_TestTlsTargetClientEcdsa_5340r1app_tgt_gcc_cc3xx_legacy_bd64
5340r1app_tgt_gcc_cc3xx_legacy_bd64
Test Case Result Duration [s]
All PASSED ERROR FAILED MISSED IGNORED NOT_EXECUTED
5 0 0 0 0 0 5
test_host_server_target_client_ECDHE_ECDSA_AES128_CCM NOT_EXECUTED N/A  
test_host_server_target_client_ECDHE_ECDSA_AES256_CCM NOT_EXECUTED N/A  
test_host_server_target_client_ECDHE_ECDSA_AES256_GCM_SHA384 NOT_EXECUTED N/A  
test_host_server_target_client_ECDHE_PSK_AES128_CBC_SHA256 NOT_EXECUTED N/A  
test_host_server_target_client_ECDHE_PSK_CHACHA20_POLY1305 NOT_EXECUTED N/A  
Test Suite duration: N/A  
Go: all_TestTlsTargetClientEcdsa or Back

crypto_all_TestTlsTargetClientEcdsa_5340r1app_tgt_gcc_cc3xx_oberon_4bea
5340r1app_tgt_gcc_cc3xx_oberon_4bea
Test Case Result Duration [s]
All PASSED ERROR FAILED MISSED IGNORED NOT_EXECUTED
5 0 0 0 0 0 5
test_host_server_target_client_ECDHE_ECDSA_AES128_CCM NOT_EXECUTED N/A  
test_host_server_target_client_ECDHE_ECDSA_AES256_CCM NOT_EXECUTED N/A  
test_host_server_target_client_ECDHE_ECDSA_AES256_GCM_SHA384 NOT_EXECUTED N/A  
test_host_server_target_client_ECDHE_PSK_AES128_CBC_SHA256 NOT_EXECUTED N/A  
test_host_server_target_client_ECDHE_PSK_CHACHA20_POLY1305 NOT_EXECUTED N/A  
Test Suite duration: N/A  
Go: all_TestTlsTargetClientEcdsa or Back

crypto_all_TestTlsTargetClientEcdsa_54l15app_ns_tgt_gcc_cracen_8e7d
54l15app_ns_tgt_gcc_cracen_8e7d
Test Case Result Duration [s]
All PASSED ERROR FAILED MISSED IGNORED NOT_EXECUTED
5 0 0 0 0 0 5
test_host_server_target_client_ECDHE_ECDSA_AES128_CCM NOT_EXECUTED N/A  
test_host_server_target_client_ECDHE_ECDSA_AES256_CCM NOT_EXECUTED N/A  
test_host_server_target_client_ECDHE_ECDSA_AES256_GCM_SHA384 NOT_EXECUTED N/A  
test_host_server_target_client_ECDHE_PSK_AES128_CBC_SHA256 NOT_EXECUTED N/A  
test_host_server_target_client_ECDHE_PSK_CHACHA20_POLY1305 NOT_EXECUTED N/A  
Test Suite duration: N/A  
Go: all_TestTlsTargetClientEcdsa or Back

crypto_all_TestTlsTargetClientEcdsa_54l15app_tgt_gcc_cracen_6f87
54l15app_tgt_gcc_cracen_6f87
Test Case Result Duration [s]
All PASSED ERROR FAILED MISSED IGNORED NOT_EXECUTED
5 0 0 0 0 0 5
test_host_server_target_client_ECDHE_ECDSA_AES128_CCM NOT_EXECUTED N/A  
test_host_server_target_client_ECDHE_ECDSA_AES256_CCM NOT_EXECUTED N/A  
test_host_server_target_client_ECDHE_ECDSA_AES256_GCM_SHA384 NOT_EXECUTED N/A  
test_host_server_target_client_ECDHE_PSK_AES128_CBC_SHA256 NOT_EXECUTED N/A  
test_host_server_target_client_ECDHE_PSK_CHACHA20_POLY1305 NOT_EXECUTED N/A  
Test Suite duration: N/A  
Go: all_TestTlsTargetClientEcdsa or Back

crypto_all_TestTlsTargetServerEcdsaSecp384r1_54l15app_ns_tgt_gcc_cracen_8e7d
54l15app_ns_tgt_gcc_cracen_8e7d
Test Case Result Duration [s]
All PASSED ERROR FAILED MISSED IGNORED NOT_EXECUTED
5 0 0 0 0 0 5
test_host_client_target_server_ECDHE_ECDSA_AES128_CCM NOT_EXECUTED N/A  
test_host_client_target_server_ECDHE_ECDSA_AES256_CCM NOT_EXECUTED N/A  
test_host_client_target_server_ECDHE_ECDSA_AES256_GCM_SHA384 NOT_EXECUTED N/A  
test_host_client_target_server_ECDHE_PSK_AES128_CBC_SHA256 NOT_EXECUTED N/A  
test_host_client_target_server_ECDHE_PSK_CHACHA20_POLY1305 NOT_EXECUTED N/A  
Test Suite duration: N/A  
Go: all_TestTlsTargetServerEcdsaSecp384r1 or Back

crypto_all_TestTlsTargetServerEcdsaSecp384r1_54l15app_tgt_gcc_cracen_6f87
54l15app_tgt_gcc_cracen_6f87
Test Case Result Duration [s]
All PASSED ERROR FAILED MISSED IGNORED NOT_EXECUTED
5 0 0 0 0 0 5
test_host_client_target_server_ECDHE_ECDSA_AES128_CCM NOT_EXECUTED N/A  
test_host_client_target_server_ECDHE_ECDSA_AES256_CCM NOT_EXECUTED N/A  
test_host_client_target_server_ECDHE_ECDSA_AES256_GCM_SHA384 NOT_EXECUTED N/A  
test_host_client_target_server_ECDHE_PSK_AES128_CBC_SHA256 NOT_EXECUTED N/A  
test_host_client_target_server_ECDHE_PSK_CHACHA20_POLY1305 NOT_EXECUTED N/A  
Test Suite duration: N/A  
Go: all_TestTlsTargetServerEcdsaSecp384r1 or Back

crypto_all_TestTlsTargetServerEcdsa_5340r1app_ns_tgt_gcc_cc3xx_oberon_c236
5340r1app_ns_tgt_gcc_cc3xx_oberon_c236
Test Case Result Duration [s]
All PASSED ERROR FAILED MISSED IGNORED NOT_EXECUTED
5 0 0 0 0 0 5
test_host_client_target_server_ECDHE_ECDSA_AES128_CCM NOT_EXECUTED N/A  
test_host_client_target_server_ECDHE_ECDSA_AES256_CCM NOT_EXECUTED N/A  
test_host_client_target_server_ECDHE_ECDSA_AES256_GCM_SHA384 NOT_EXECUTED N/A  
test_host_client_target_server_ECDHE_PSK_AES128_CBC_SHA256 NOT_EXECUTED N/A  
test_host_client_target_server_ECDHE_PSK_CHACHA20_POLY1305 NOT_EXECUTED N/A  
Test Suite duration: N/A  
Go: all_TestTlsTargetServerEcdsa or Back

crypto_all_TestTlsTargetServerEcdsa_5340r1app_tgt_gcc_cc3xx_legacy_bd64
5340r1app_tgt_gcc_cc3xx_legacy_bd64
Test Case Result Duration [s]
All PASSED ERROR FAILED MISSED IGNORED NOT_EXECUTED
5 0 0 0 0 0 5
test_host_client_target_server_ECDHE_ECDSA_AES128_CCM NOT_EXECUTED N/A  
test_host_client_target_server_ECDHE_ECDSA_AES256_CCM NOT_EXECUTED N/A  
test_host_client_target_server_ECDHE_ECDSA_AES256_GCM_SHA384 NOT_EXECUTED N/A  
test_host_client_target_server_ECDHE_PSK_AES128_CBC_SHA256 NOT_EXECUTED N/A  
test_host_client_target_server_ECDHE_PSK_CHACHA20_POLY1305 NOT_EXECUTED N/A  
Test Suite duration: N/A  
Go: all_TestTlsTargetServerEcdsa or Back

crypto_all_TestTlsTargetServerEcdsa_5340r1app_tgt_gcc_cc3xx_oberon_4bea
5340r1app_tgt_gcc_cc3xx_oberon_4bea
Test Case Result Duration [s]
All PASSED ERROR FAILED MISSED IGNORED NOT_EXECUTED
5 0 0 0 0 0 5
test_host_client_target_server_ECDHE_ECDSA_AES128_CCM NOT_EXECUTED N/A  
test_host_client_target_server_ECDHE_ECDSA_AES256_CCM NOT_EXECUTED N/A  
test_host_client_target_server_ECDHE_ECDSA_AES256_GCM_SHA384 NOT_EXECUTED N/A  
test_host_client_target_server_ECDHE_PSK_AES128_CBC_SHA256 NOT_EXECUTED N/A  
test_host_client_target_server_ECDHE_PSK_CHACHA20_POLY1305 NOT_EXECUTED N/A  
Test Suite duration: N/A  
Go: all_TestTlsTargetServerEcdsa or Back

crypto_all_TestTlsTargetServerEcdsa_54l15app_ns_tgt_gcc_cracen_8e7d
54l15app_ns_tgt_gcc_cracen_8e7d
Test Case Result Duration [s]
All PASSED ERROR FAILED MISSED IGNORED NOT_EXECUTED
5 0 0 0 0 0 5
test_host_client_target_server_ECDHE_ECDSA_AES128_CCM NOT_EXECUTED N/A  
test_host_client_target_server_ECDHE_ECDSA_AES256_CCM NOT_EXECUTED N/A  
test_host_client_target_server_ECDHE_ECDSA_AES256_GCM_SHA384 NOT_EXECUTED N/A  
test_host_client_target_server_ECDHE_PSK_AES128_CBC_SHA256 NOT_EXECUTED N/A  
test_host_client_target_server_ECDHE_PSK_CHACHA20_POLY1305 NOT_EXECUTED N/A  
Test Suite duration: N/A  
Go: all_TestTlsTargetServerEcdsa or Back

crypto_all_TestTlsTargetServerEcdsa_54l15app_tgt_gcc_cracen_6f87
54l15app_tgt_gcc_cracen_6f87
Test Case Result Duration [s]
All PASSED ERROR FAILED MISSED IGNORED NOT_EXECUTED
5 0 0 0 0 0 5
test_host_client_target_server_ECDHE_ECDSA_AES128_CCM NOT_EXECUTED N/A  
test_host_client_target_server_ECDHE_ECDSA_AES256_CCM NOT_EXECUTED N/A  
test_host_client_target_server_ECDHE_ECDSA_AES256_GCM_SHA384 NOT_EXECUTED N/A  
test_host_client_target_server_ECDHE_PSK_AES128_CBC_SHA256 NOT_EXECUTED N/A  
test_host_client_target_server_ECDHE_PSK_CHACHA20_POLY1305 NOT_EXECUTED N/A  
Test Suite duration: N/A  
Go: all_TestTlsTargetServerEcdsa or Back

dtm_TestSuiteRadioTestOnCommit_52840r3_tgt_gcc_ce4c__52840r3_gcc_cf1a
52840r3_tgt_gcc_ce4c__52840r3_gcc_cf1a
Test Case Result Duration [s]
All PASSED ERROR FAILED MISSED IGNORED NOT_EXECUTED
2 2 0 0 0 0 0
test_radio_test_ble_2mbit PASSED 53.21  
test_radio_test_nrf_1mbit PASSED 51.10  
Test Suite duration: N/A  
Go: TestSuiteRadioTestOnCommit or Back

dtm_TestSuiteRadioTestOnCommit_5340_tgt_2363__5340_f32b
5340_tgt_2363__5340_f32b
Test Case Result Duration [s]
All PASSED ERROR FAILED MISSED IGNORED NOT_EXECUTED
2 2 0 0 0 0 0
test_radio_test_ble_2mbit PASSED 44.44  
test_radio_test_nrf_1mbit PASSED 55.03  
Test Suite duration: N/A  
Go: TestSuiteRadioTestOnCommit or Back

dtm_TestSuiteRadioTestOnCommit_54h20fp1_tgt_87e3__52840r3_gcc_sdc_e902
54h20fp1_tgt_87e3__52840r3_gcc_sdc_e902
Test Case Result Duration [s]
All PASSED ERROR FAILED MISSED IGNORED NOT_EXECUTED
2 2 0 0 0 0 0
test_radio_test_ble_2mbit PASSED 48.26  
test_radio_test_nrf_1mbit PASSED 50.82  
Test Suite duration: N/A  
Go: TestSuiteRadioTestOnCommit or Back

dtm_TestSuiteRadioTestOnCommit_54l15app_tgt_gcc_sdc_6f23__54l15app_gcc_sdc_6551
54l15app_tgt_gcc_sdc_6f23__54l15app_gcc_sdc_6551
Test Case Result Duration [s]
All PASSED ERROR FAILED MISSED IGNORED NOT_EXECUTED
2 2 0 0 0 0 0
test_radio_test_ble_2mbit PASSED 49.68  
test_radio_test_nrf_1mbit PASSED 51.05  
Test Suite duration: N/A  
Go: TestSuiteRadioTestOnCommit or Back

dtm_TestSuiteRadioTestOnCommit_54lm20a_dk_tgt_gcc_sdc_3589__52840r3_gcc_sdc_e902
54lm20a_dk_tgt_gcc_sdc_3589__52840r3_gcc_sdc_e902
Test Case Result Duration [s]
All PASSED ERROR FAILED MISSED IGNORED NOT_EXECUTED
2 2 0 0 0 0 0
test_radio_test_ble_2mbit PASSED 49.28  
test_radio_test_nrf_1mbit PASSED 50.69  
Test Suite duration: N/A  
Go: TestSuiteRadioTestOnCommit or Back

fmn_CoexistenceSampleTest_52840r2_tgt_gcc_70a5__9a72d0af
52840r2_tgt_gcc_70a5__9a72d0af
Test Case Result Duration [s]
All PASSED ERROR FAILED MISSED IGNORED NOT_EXECUTED
1 1 0 0 0 0 0
test_sanity_test PASSED 35.24  
Test Suite duration: N/A  
Go: CoexistenceSampleTest or Back

fmn_CoexistenceSampleTest_54l15app_tgt_gcc_0791__4f6efc41
54l15app_tgt_gcc_0791__4f6efc41
Test Case Result Duration [s]
All PASSED ERROR FAILED MISSED IGNORED NOT_EXECUTED
1 1 0 0 0 0 0
test_sanity_test PASSED 34.19  
Test Suite duration: N/A  
Go: CoexistenceSampleTest or Back

fmn_NcsFmnToolsExtract_52840r2_tgt_gcc_70a5__9a72d0af
52840r2_tgt_gcc_70a5__9a72d0af
Test Case Result Duration [s]
All PASSED ERROR FAILED MISSED IGNORED NOT_EXECUTED
10 10 0 0 0 0 0
test_extract_DUT_not_connected PASSED 0.40  
test_extract_alternative_device_argument PASSED 3.59  
test_extract_correct_setting_base PASSED 30.85  
test_extract_display_help PASSED 0.14  
test_extract_incorrect_argument PASSED 0.12  
test_extract_incorrect_device PASSED 0.00  
test_extract_incorrect_setting_base PASSED 1.04  
test_extract_no_arguments PASSED 0.12  
test_extract_provisioned_data PASSED 1.12  
test_extract_wrong_device PASSED 0.88  
Test Suite duration: N/A  
Go: NcsFmnToolsExtract or Back

fmn_NcsFmnToolsProvision_52840r2_tgt_gcc_70a5__9a72d0af
52840r2_tgt_gcc_70a5__9a72d0af
Test Case Result Duration [s]
All PASSED ERROR FAILED MISSED IGNORED NOT_EXECUTED
16 16 0 0 0 0 0
test_correct_device PASSED 0.37  
test_correct_serial_number PASSED 0.12  
test_correct_setting_base PASSED 0.61  
test_display_help PASSED 0.15  
test_generate_input_file PASSED 1.07  
test_generate_provisioned_file PASSED 0.12  
test_incorrect_argument PASSED 0.12  
test_incorrect_device PASSED 0.90  
test_incorrect_output_path PASSED 0.40  
test_incorrect_serial_number PASSED 0.49  
test_incorrect_setting_base PASSED 0.68  
test_incorrect_token PASSED 0.24  
test_incorrect_uuid PASSED 0.70  
test_no_arguments PASSED 0.13  
test_set_output_path PASSED 0.43  
test_wrong_input_file PASSED 0.69  
Test Suite duration: N/A  
Go: NcsFmnToolsProvision or Back

fmn_NcsFmnToolsSuperBinary_52840r2_tgt_gcc_70a5__9a72d0af
52840r2_tgt_gcc_70a5__9a72d0af
Test Case Result Duration [s]
All PASSED ERROR FAILED MISSED IGNORED NOT_EXECUTED
14 14 0 0 0 0 0
test_create_superbinary_files PASSED 15.45  
test_debug_info PASSED 15.17  
test_display_help PASSED 15.16  
test_existing_metadata_file PASSED 15.43  
test_incorrect_payloads_dir_path PASSED 15.39  
test_incorrect_plist_input_file PASSED 15.66  
test_incorrect_plist_output_file PASSED 15.29  
test_incorrect_release_notes_path PASSED 15.36  
test_missing_metadata_param PASSED 15.31  
test_no_arguments PASSED 15.21  
test_rename_plist_output_file PASSED 15.42  
test_skip_version_checks PASSED 15.18  
test_unnecessary_metadata_param PASSED 15.18  
test_version_mismatch PASSED 15.31  
Test Suite duration: N/A  
Go: NcsFmnToolsSuperBinary or Back

fmn_NfcReadoutUnpairedTests_52840r2_tgt_gcc_70a5__9a72d0af
52840r2_tgt_gcc_70a5__9a72d0af
Test Case Result Duration [s]
All PASSED ERROR FAILED MISSED IGNORED NOT_EXECUTED
4 4 0 0 0 0 0
test_battery_status_change PASSED 61.11  
test_parameters_value PASSED 22.67  
test_readout_device PASSED 22.70  
test_write_tag_fail PASSED 29.92  
Test Suite duration: N/A  
Go: NfcReadoutUnpairedTests or Back

fmn_NfcReadoutUnpairedTests_54l15app_tgt_gcc_0791__4f6efc41
54l15app_tgt_gcc_0791__4f6efc41
Test Case Result Duration [s]
All PASSED ERROR FAILED MISSED IGNORED NOT_EXECUTED
4 4 0 0 0 0 0
test_battery_status_change PASSED 51.05  
test_parameters_value PASSED 20.81  
test_readout_device PASSED 19.58  
test_write_tag_fail PASSED 25.95  
Test Suite duration: N/A  
Go: NfcReadoutUnpairedTests or Back

fmn_QualificationSampleTest_52840r2_tgt_gcc_70a5__9a72d0af
52840r2_tgt_gcc_70a5__9a72d0af
Test Case Result Duration [s]
All PASSED ERROR FAILED MISSED IGNORED NOT_EXECUTED
1 1 0 0 0 0 0
test_sanity_test PASSED 35.15  
Test Suite duration: N/A  
Go: QualificationSampleTest or Back

fmn_QualificationSampleTest_54l15app_tgt_gcc_0791__4f6efc41
54l15app_tgt_gcc_0791__4f6efc41
Test Case Result Duration [s]
All PASSED ERROR FAILED MISSED IGNORED NOT_EXECUTED
1 1 0 0 0 0 0
test_sanity_test PASSED 34.22  
Test Suite duration: N/A  
Go: QualificationSampleTest or Back

fmn_SimpleSampleTest_52840r2_tgt_gcc_70a5__9a72d0af
52840r2_tgt_gcc_70a5__9a72d0af
Test Case Result Duration [s]
All PASSED ERROR FAILED MISSED IGNORED NOT_EXECUTED
1 0 0 0 0 0 1
test_sanity_test NOT_EXECUTED N/A  
Test Suite duration: N/A  
Go: SimpleSampleTest or Back

fmn_SimpleSampleTest_54l15app_tgt_gcc_0791__4f6efc41
54l15app_tgt_gcc_0791__4f6efc41
Test Case Result Duration [s]
All PASSED ERROR FAILED MISSED IGNORED NOT_EXECUTED
1 0 0 0 0 0 1
test_sanity_test NOT_EXECUTED N/A  
Test Suite duration: N/A  
Go: SimpleSampleTest or Back

gateway_only_BuildGateway_anlg_fwd_cis_debug_5340adk_tgt_none_a46b__52840r3_none_366b
5340adk_tgt_none_a46b__52840r3_none_366b
Test Case Result Duration [s]
All PASSED ERROR FAILED MISSED IGNORED NOT_EXECUTED
1 0 0 0 0 0 1
test_build_deliverable NOT_EXECUTED N/A  
Test Suite duration: N/A  
Go: only_BuildGateway_anlg_fwd_cis_debug or Back

gateway_only_BuildGateway_digi_ret_cis_debug_5340adk_tgt_none_a46b__52840r3_none_366b
5340adk_tgt_none_a46b__52840r3_none_366b
Test Case Result Duration [s]
All PASSED ERROR FAILED MISSED IGNORED NOT_EXECUTED
1 0 0 0 0 0 1
test_build_deliverable NOT_EXECUTED N/A  
Test Suite duration: N/A  
Go: only_BuildGateway_digi_ret_cis_debug or Back

headset_only_BuildHeadset_anlg_fwd_cis_debug_5340adk_tgt_none_4a53__52840r3_none_366b
5340adk_tgt_none_4a53__52840r3_none_366b
Test Case Result Duration [s]
All PASSED ERROR FAILED MISSED IGNORED NOT_EXECUTED
1 0 0 0 0 0 1
test_build_deliverable NOT_EXECUTED N/A  
Test Suite duration: N/A  
Go: only_BuildHeadset_anlg_fwd_cis_debug or Back

headset_only_BuildHeadset_digi_ret_cis_debug_5340adk_tgt_none_4a53__52840r3_none_366b
5340adk_tgt_none_4a53__52840r3_none_366b
Test Case Result Duration [s]
All PASSED ERROR FAILED MISSED IGNORED NOT_EXECUTED
1 0 0 0 0 0 1
test_build_deliverable NOT_EXECUTED N/A  
Test Suite duration: N/A  
Go: only_BuildHeadset_digi_ret_cis_debug or Back

nfc_NfcNFCID1Change_t2t_52840r2_tgt_gcc_nfct2_71f9__0336cc8a
52840r2_tgt_gcc_nfct2_71f9__0336cc8a
Test Case Result Duration [s]
All PASSED ERROR FAILED MISSED IGNORED NOT_EXECUTED
6 0 0 0 0 0 6
test_1_0_default NOT_EXECUTED N/A  
test_1_1_default NOT_EXECUTED N/A  
test_1_2_default NOT_EXECUTED N/A  
test_1_3_custom NOT_EXECUTED N/A  
test_1_4_custom NOT_EXECUTED N/A  
test_1_5_custom NOT_EXECUTED N/A  
Test Suite duration: N/A  
Go: NfcNFCID1Change_t2t or Back

nfc_NfcNFCID1Change_t2t_5340r1app_tgt_gcc_nfct2_6179__99f47a86
5340r1app_tgt_gcc_nfct2_6179__99f47a86
Test Case Result Duration [s]
All PASSED ERROR FAILED MISSED IGNORED NOT_EXECUTED
6 0 0 0 0 0 6
test_1_0_default NOT_EXECUTED N/A  
test_1_1_default NOT_EXECUTED N/A  
test_1_2_default NOT_EXECUTED N/A  
test_1_3_custom NOT_EXECUTED N/A  
test_1_4_custom NOT_EXECUTED N/A  
test_1_5_custom NOT_EXECUTED N/A  
Test Suite duration: N/A  
Go: NfcNFCID1Change_t2t or Back

nfc_NfcNFCID1Change_t2t_54l15app_tgt_gcc_nfct2_a53a__e51617bc
54l15app_tgt_gcc_nfct2_a53a__e51617bc
Test Case Result Duration [s]
All PASSED ERROR FAILED MISSED IGNORED NOT_EXECUTED
6 0 0 0 0 0 6
test_1_0_default NOT_EXECUTED N/A  
test_1_1_default NOT_EXECUTED N/A  
test_1_2_default NOT_EXECUTED N/A  
test_1_3_custom NOT_EXECUTED N/A  
test_1_4_custom NOT_EXECUTED N/A  
test_1_5_custom NOT_EXECUTED N/A  
Test Suite duration: N/A  
Go: NfcNFCID1Change_t2t or Back

nfc_NfcNFCID1Change_t4t_52840r2_tgt_gcc_nfct2_71f9__0336cc8a
52840r2_tgt_gcc_nfct2_71f9__0336cc8a
Test Case Result Duration [s]
All PASSED ERROR FAILED MISSED IGNORED NOT_EXECUTED
6 0 0 0 0 0 6
test_1_0_default NOT_EXECUTED N/A  
test_1_1_default NOT_EXECUTED N/A  
test_1_2_default NOT_EXECUTED N/A  
test_1_3_custom NOT_EXECUTED N/A  
test_1_4_custom NOT_EXECUTED N/A  
test_1_5_custom NOT_EXECUTED N/A  
Test Suite duration: N/A  
Go: NfcNFCID1Change_t4t or Back

nfc_NfcNFCID1Change_t4t_5340r1app_tgt_gcc_nfct2_6179__99f47a86
5340r1app_tgt_gcc_nfct2_6179__99f47a86
Test Case Result Duration [s]
All PASSED ERROR FAILED MISSED IGNORED NOT_EXECUTED
6 0 0 0 0 0 6
test_1_0_default NOT_EXECUTED N/A  
test_1_1_default NOT_EXECUTED N/A  
test_1_2_default NOT_EXECUTED N/A  
test_1_3_custom NOT_EXECUTED N/A  
test_1_4_custom NOT_EXECUTED N/A  
test_1_5_custom NOT_EXECUTED N/A  
Test Suite duration: N/A  
Go: NfcNFCID1Change_t4t or Back

nfc_NfcNFCID1Change_t4t_54l15app_tgt_gcc_nfct2_a53a__e51617bc
54l15app_tgt_gcc_nfct2_a53a__e51617bc
Test Case Result Duration [s]
All PASSED ERROR FAILED MISSED IGNORED NOT_EXECUTED
6 0 0 0 0 0 6
test_1_0_default NOT_EXECUTED N/A  
test_1_1_default NOT_EXECUTED N/A  
test_1_2_default NOT_EXECUTED N/A  
test_1_3_custom NOT_EXECUTED N/A  
test_1_4_custom NOT_EXECUTED N/A  
test_1_5_custom NOT_EXECUTED N/A  
Test Suite duration: N/A  
Go: NfcNFCID1Change_t4t or Back

nfc_NfcNewlibWritableNdefTests__52840r2_tgt_gcc_nfct2_71f9__0336cc8a
52840r2_tgt_gcc_nfct2_71f9__0336cc8a
Test Case Result Duration [s]
All PASSED ERROR FAILED MISSED IGNORED NOT_EXECUTED
3 0 0 0 0 0 3
test_1_nfc_newlib_writable_ndef_message_0_url NOT_EXECUTED N/A  
test_1_nfc_newlib_writable_ndef_message_1_empty NOT_EXECUTED N/A  
test_1_nfc_newlib_writable_ndef_message_2_special_characters NOT_EXECUTED N/A  
Test Suite duration: N/A  
Go: NfcNewlibWritableNdefTests_ or Back

nfc_NfcNewlibWritableNdefTests__5340r1app_tgt_gcc_nfct2_6179__99f47a86
5340r1app_tgt_gcc_nfct2_6179__99f47a86
Test Case Result Duration [s]
All PASSED ERROR FAILED MISSED IGNORED NOT_EXECUTED
3 0 0 0 0 0 3
test_1_nfc_newlib_writable_ndef_message_0_url NOT_EXECUTED N/A  
test_1_nfc_newlib_writable_ndef_message_1_empty NOT_EXECUTED N/A  
test_1_nfc_newlib_writable_ndef_message_2_special_characters NOT_EXECUTED N/A  
Test Suite duration: N/A  
Go: NfcNewlibWritableNdefTests_ or Back

nfc_NfcNewlibWritableNdefTests__54l15app_tgt_gcc_nfct2_a53a__e51617bc
54l15app_tgt_gcc_nfct2_a53a__e51617bc
Test Case Result Duration [s]
All PASSED ERROR FAILED MISSED IGNORED NOT_EXECUTED
3 0 0 0 0 0 3
test_1_nfc_newlib_writable_ndef_message_0_url NOT_EXECUTED N/A  
test_1_nfc_newlib_writable_ndef_message_1_empty NOT_EXECUTED N/A  
test_1_nfc_newlib_writable_ndef_message_2_special_characters NOT_EXECUTED N/A  
Test Suite duration: N/A  
Go: NfcNewlibWritableNdefTests_ or Back

nfc_NfcRecordLaunchAppTests__52840r2_tgt_gcc_nfct2_71f9__0336cc8a
52840r2_tgt_gcc_nfct2_71f9__0336cc8a
Test Case Result Duration [s]
All PASSED ERROR FAILED MISSED IGNORED NOT_EXECUTED
1 0 0 0 0 0 1
test_1_nfc_launch_app NOT_EXECUTED N/A  
Test Suite duration: N/A  
Go: NfcRecordLaunchAppTests_ or Back

nfc_NfcRecordLaunchAppTests__5340r1app_tgt_gcc_nfct2_6179__99f47a86
5340r1app_tgt_gcc_nfct2_6179__99f47a86
Test Case Result Duration [s]
All PASSED ERROR FAILED MISSED IGNORED NOT_EXECUTED
1 1 0 0 0 0 0
test_1_nfc_launch_app PASSED 74.63  
Test Suite duration: N/A  
Go: NfcRecordLaunchAppTests_ or Back

nfc_NfcRecordLaunchAppTests__54l15app_tgt_gcc_nfct2_a53a__e51617bc
54l15app_tgt_gcc_nfct2_a53a__e51617bc
Test Case Result Duration [s]
All PASSED ERROR FAILED MISSED IGNORED NOT_EXECUTED
1 1 0 0 0 0 0
test_1_nfc_launch_app PASSED 72.36  
Test Suite duration: N/A  
Go: NfcRecordLaunchAppTests_ or Back

nfc_NfcRecordTextNightlyTests__52840r2_tgt_gcc_nfct2_71f9__0336cc8a
52840r2_tgt_gcc_nfct2_71f9__0336cc8a
Test Case Result Duration [s]
All PASSED ERROR FAILED MISSED IGNORED NOT_EXECUTED
3 0 0 0 0 0 3
test_1_nfc_record_text NOT_EXECUTED N/A  
test_3_nfc_record_text_write_invalid_0_cmd NOT_EXECUTED N/A  
test_3_nfc_record_text_write_invalid_1_message_length NOT_EXECUTED N/A  
Test Suite duration: N/A  
Go: NfcRecordTextNightlyTests_ or Back

nfc_NfcRecordTextNightlyTests__5340r1app_tgt_gcc_nfct2_6179__99f47a86
5340r1app_tgt_gcc_nfct2_6179__99f47a86
Test Case Result Duration [s]
All PASSED ERROR FAILED MISSED IGNORED NOT_EXECUTED
3 0 0 0 0 0 3
test_1_nfc_record_text NOT_EXECUTED N/A  
test_3_nfc_record_text_write_invalid_0_cmd NOT_EXECUTED N/A  
test_3_nfc_record_text_write_invalid_1_message_length NOT_EXECUTED N/A  
Test Suite duration: N/A  
Go: NfcRecordTextNightlyTests_ or Back

nfc_NfcRecordTextNightlyTests__54l15app_tgt_gcc_nfct2_a53a__e51617bc
54l15app_tgt_gcc_nfct2_a53a__e51617bc
Test Case Result Duration [s]
All PASSED ERROR FAILED MISSED IGNORED NOT_EXECUTED
3 0 0 0 0 0 3
test_1_nfc_record_text NOT_EXECUTED N/A  
test_3_nfc_record_text_write_invalid_0_cmd NOT_EXECUTED N/A  
test_3_nfc_record_text_write_invalid_1_message_length NOT_EXECUTED N/A  
Test Suite duration: N/A  
Go: NfcRecordTextNightlyTests_ or Back

nfc_NfcRecordTextTests__52840r2_tgt_gcc_nfct2_71f9__0336cc8a
52840r2_tgt_gcc_nfct2_71f9__0336cc8a
Test Case Result Duration [s]
All PASSED ERROR FAILED MISSED IGNORED NOT_EXECUTED
1 0 0 0 0 0 1
test_1_nfc_record_text_write NOT_EXECUTED N/A  
Test Suite duration: N/A  
Go: NfcRecordTextTests_ or Back

nfc_NfcRecordTextTests__5340r1app_tgt_gcc_nfct2_6179__99f47a86
5340r1app_tgt_gcc_nfct2_6179__99f47a86
Test Case Result Duration [s]
All PASSED ERROR FAILED MISSED IGNORED NOT_EXECUTED
1 1 0 0 0 0 0
test_1_nfc_record_text_write PASSED 134.10  
Test Suite duration: N/A  
Go: NfcRecordTextTests_ or Back

nfc_NfcRecordTextTests__54l15app_tgt_gcc_nfct2_a53a__e51617bc
54l15app_tgt_gcc_nfct2_a53a__e51617bc
Test Case Result Duration [s]
All PASSED ERROR FAILED MISSED IGNORED NOT_EXECUTED
1 1 0 0 0 0 0
test_1_nfc_record_text_write PASSED 131.19  
Test Suite duration: N/A  
Go: NfcRecordTextTests_ or Back

nfc_NfcT4TChainedFromPCDTests__52840r2_tgt_gcc_nfct2_71f9__0336cc8a
52840r2_tgt_gcc_nfct2_71f9__0336cc8a
Test Case Result Duration [s]
All PASSED ERROR FAILED MISSED IGNORED NOT_EXECUTED
1 0 0 0 0 0 1
test_1_isodep_chaining_from_reader_to_tag NOT_EXECUTED N/A  
Test Suite duration: N/A  
Go: NfcT4TChainedFromPCDTests_ or Back

nfc_NfcT4TChainedFromPCDTests__5340r1app_tgt_gcc_nfct2_6179__99f47a86
5340r1app_tgt_gcc_nfct2_6179__99f47a86
Test Case Result Duration [s]
All PASSED ERROR FAILED MISSED IGNORED NOT_EXECUTED
1 0 0 0 0 0 1
test_1_isodep_chaining_from_reader_to_tag NOT_EXECUTED N/A  
Test Suite duration: N/A  
Go: NfcT4TChainedFromPCDTests_ or Back

nfc_NfcT4TChainedFromPCDTests__54l15app_tgt_gcc_nfct2_a53a__e51617bc
54l15app_tgt_gcc_nfct2_a53a__e51617bc
Test Case Result Duration [s]
All PASSED ERROR FAILED MISSED IGNORED NOT_EXECUTED
1 0 0 0 0 0 1
test_1_isodep_chaining_from_reader_to_tag NOT_EXECUTED N/A  
Test Suite duration: N/A  
Go: NfcT4TChainedFromPCDTests_ or Back

nfc_NfcT4TChainedFromPICCTests__52840r2_tgt_gcc_nfct2_71f9__0336cc8a
52840r2_tgt_gcc_nfct2_71f9__0336cc8a
Test Case Result Duration [s]
All PASSED ERROR FAILED MISSED IGNORED NOT_EXECUTED
1 0 0 0 0 0 1
test_1_isodep_chaining_from_tag_to_reader NOT_EXECUTED N/A  
Test Suite duration: N/A  
Go: NfcT4TChainedFromPICCTests_ or Back

nfc_NfcT4TChainedFromPICCTests__5340r1app_tgt_gcc_nfct2_6179__99f47a86
5340r1app_tgt_gcc_nfct2_6179__99f47a86
Test Case Result Duration [s]
All PASSED ERROR FAILED MISSED IGNORED NOT_EXECUTED
1 0 0 0 0 0 1
test_1_isodep_chaining_from_tag_to_reader NOT_EXECUTED N/A  
Test Suite duration: N/A  
Go: NfcT4TChainedFromPICCTests_ or Back

nfc_NfcT4TChainedFromPICCTests__54l15app_tgt_gcc_nfct2_a53a__e51617bc
54l15app_tgt_gcc_nfct2_a53a__e51617bc
Test Case Result Duration [s]
All PASSED ERROR FAILED MISSED IGNORED NOT_EXECUTED
1 0 0 0 0 0 1
test_1_isodep_chaining_from_tag_to_reader NOT_EXECUTED N/A  
Test Suite duration: N/A  
Go: NfcT4TChainedFromPICCTests_ or Back

nfc_NfcTNEPTagTests__52840r2_tgt_gcc_nfct2_71f9__0336cc8a
52840r2_tgt_gcc_nfct2_71f9__0336cc8a
Test Case Result Duration [s]
All PASSED ERROR FAILED MISSED IGNORED NOT_EXECUTED
8 0 0 0 0 0 8
test_1 NOT_EXECUTED N/A  
test_2_0 NOT_EXECUTED N/A  
test_2_1 NOT_EXECUTED N/A  
test_3 NOT_EXECUTED N/A  
test_4 NOT_EXECUTED N/A  
test_5 NOT_EXECUTED N/A  
test_6 NOT_EXECUTED N/A  
test_7 NOT_EXECUTED N/A  
Test Suite duration: N/A  
Go: NfcTNEPTagTests_ or Back

nfc_NfcTNEPTagTests__5340r1app_tgt_gcc_nfct2_6179__99f47a86
5340r1app_tgt_gcc_nfct2_6179__99f47a86
Test Case Result Duration [s]
All PASSED ERROR FAILED MISSED IGNORED NOT_EXECUTED
8 0 0 0 0 0 8
test_1 NOT_EXECUTED N/A  
test_2_0 NOT_EXECUTED N/A  
test_2_1 NOT_EXECUTED N/A  
test_3 NOT_EXECUTED N/A  
test_4 NOT_EXECUTED N/A  
test_5 NOT_EXECUTED N/A  
test_6 NOT_EXECUTED N/A  
test_7 NOT_EXECUTED N/A  
Test Suite duration: N/A  
Go: NfcTNEPTagTests_ or Back

nfc_NfcTNEPTagTests__54l15app_tgt_gcc_nfct2_a53a__e51617bc
54l15app_tgt_gcc_nfct2_a53a__e51617bc
Test Case Result Duration [s]
All PASSED ERROR FAILED MISSED IGNORED NOT_EXECUTED
8 0 0 0 0 0 8
test_1 NOT_EXECUTED N/A  
test_2_0 NOT_EXECUTED N/A  
test_2_1 NOT_EXECUTED N/A  
test_3 NOT_EXECUTED N/A  
test_4 NOT_EXECUTED N/A  
test_5 NOT_EXECUTED N/A  
test_6 NOT_EXECUTED N/A  
test_7 NOT_EXECUTED N/A  
Test Suite duration: N/A  
Go: NfcTNEPTagTests_ or Back

nfc_NfcWakeUpNightlyTests__52840r2_tgt_gcc_nfct2_71f9__0336cc8a
52840r2_tgt_gcc_nfct2_71f9__0336cc8a
Test Case Result Duration [s]
All PASSED ERROR FAILED MISSED IGNORED NOT_EXECUTED
4 0 0 0 0 0 4
test_1_system_is_going_to_sleep NOT_EXECUTED N/A  
test_2_system_off_interrupted NOT_EXECUTED N/A  
test_3_system_off_current_consumption NOT_EXECUTED N/A  
test_4_system_off_current_consumtion_off_after_wakeup NOT_EXECUTED N/A  
Test Suite duration: N/A  
Go: NfcWakeUpNightlyTests_ or Back

nfc_NfcWakeUpNightlyTests__5340r1app_tgt_gcc_nfct2_6179__99f47a86
5340r1app_tgt_gcc_nfct2_6179__99f47a86
Test Case Result Duration [s]
All PASSED ERROR FAILED MISSED IGNORED NOT_EXECUTED
4 0 0 0 0 0 4
test_1_system_is_going_to_sleep NOT_EXECUTED N/A  
test_2_system_off_interrupted NOT_EXECUTED N/A  
test_3_system_off_current_consumption NOT_EXECUTED N/A  
test_4_system_off_current_consumtion_off_after_wakeup NOT_EXECUTED N/A  
Test Suite duration: N/A  
Go: NfcWakeUpNightlyTests_ or Back

nfc_NfcWakeUpNightlyTests__54l15app_tgt_gcc_nfct2_a53a__e51617bc
54l15app_tgt_gcc_nfct2_a53a__e51617bc
Test Case Result Duration [s]
All PASSED ERROR FAILED MISSED IGNORED NOT_EXECUTED
4 0 0 0 0 0 4
test_1_system_is_going_to_sleep NOT_EXECUTED N/A  
test_2_system_off_interrupted NOT_EXECUTED N/A  
test_3_system_off_current_consumption NOT_EXECUTED N/A  
test_4_system_off_current_consumtion_off_after_wakeup NOT_EXECUTED N/A  
Test Suite duration: N/A  
Go: NfcWakeUpNightlyTests_ or Back

nfc_NfcWakeUpTests__52840r2_tgt_gcc_nfct2_71f9__0336cc8a
52840r2_tgt_gcc_nfct2_71f9__0336cc8a
Test Case Result Duration [s]
All PASSED ERROR FAILED MISSED IGNORED NOT_EXECUTED
1 0 0 0 0 0 1
test_1_nfc_wake_up NOT_EXECUTED N/A  
Test Suite duration: N/A  
Go: NfcWakeUpTests_ or Back

nfc_NfcWakeUpTests__5340r1app_tgt_gcc_nfct2_6179__99f47a86
5340r1app_tgt_gcc_nfct2_6179__99f47a86
Test Case Result Duration [s]
All PASSED ERROR FAILED MISSED IGNORED NOT_EXECUTED
1 1 0 0 0 0 0
test_1_nfc_wake_up PASSED 48.46  
Test Suite duration: N/A  
Go: NfcWakeUpTests_ or Back

nfc_NfcWakeUpTests__54l15app_tgt_gcc_nfct2_a53a__e51617bc
54l15app_tgt_gcc_nfct2_a53a__e51617bc
Test Case Result Duration [s]
All PASSED ERROR FAILED MISSED IGNORED NOT_EXECUTED
1 1 0 0 0 0 0
test_1_nfc_wake_up PASSED 42.57  
Test Suite duration: N/A  
Go: NfcWakeUpTests_ or Back

nfc_NfcWritableNdefBufferChangeTests__52840r2_tgt_gcc_nfct2_71f9__0336cc8a
52840r2_tgt_gcc_nfct2_71f9__0336cc8a
Test Case Result Duration [s]
All PASSED ERROR FAILED MISSED IGNORED NOT_EXECUTED
7 0 0 0 0 0 7
test_1_buffer_change_on_demand NOT_EXECUTED N/A  
test_2_buffer_can_be_changed_back NOT_EXECUTED N/A  
test_3_buffer_content_change_to_custom_value NOT_EXECUTED N/A  
test_4_activated_buffer_resets_to_default_after_device_reset NOT_EXECUTED N/A  
test_5_buffer_value_resets_to_default_after_device_reset NOT_EXECUTED N/A  
test_6_content_change_does_not_effect_swap_functionality NOT_EXECUTED N/A  
test_7_buffer_change_to_currently_used_one_not_break_device NOT_EXECUTED N/A  
Test Suite duration: N/A  
Go: NfcWritableNdefBufferChangeTests_ or Back

nfc_NfcWritableNdefBufferChangeTests__5340r1app_tgt_gcc_nfct2_6179__99f47a86
5340r1app_tgt_gcc_nfct2_6179__99f47a86
Test Case Result Duration [s]
All PASSED ERROR FAILED MISSED IGNORED NOT_EXECUTED
7 0 0 0 0 0 7
test_1_buffer_change_on_demand NOT_EXECUTED N/A  
test_2_buffer_can_be_changed_back NOT_EXECUTED N/A  
test_3_buffer_content_change_to_custom_value NOT_EXECUTED N/A  
test_4_activated_buffer_resets_to_default_after_device_reset NOT_EXECUTED N/A  
test_5_buffer_value_resets_to_default_after_device_reset NOT_EXECUTED N/A  
test_6_content_change_does_not_effect_swap_functionality NOT_EXECUTED N/A  
test_7_buffer_change_to_currently_used_one_not_break_device NOT_EXECUTED N/A  
Test Suite duration: N/A  
Go: NfcWritableNdefBufferChangeTests_ or Back

nfc_NfcWritableNdefBufferChangeTests__54l15app_tgt_gcc_nfct2_a53a__e51617bc
54l15app_tgt_gcc_nfct2_a53a__e51617bc
Test Case Result Duration [s]
All PASSED ERROR FAILED MISSED IGNORED NOT_EXECUTED
7 0 0 0 0 0 7
test_1_buffer_change_on_demand NOT_EXECUTED N/A  
test_2_buffer_can_be_changed_back NOT_EXECUTED N/A  
test_3_buffer_content_change_to_custom_value NOT_EXECUTED N/A  
test_4_activated_buffer_resets_to_default_after_device_reset NOT_EXECUTED N/A  
test_5_buffer_value_resets_to_default_after_device_reset NOT_EXECUTED N/A  
test_6_content_change_does_not_effect_swap_functionality NOT_EXECUTED N/A  
test_7_buffer_change_to_currently_used_one_not_break_device NOT_EXECUTED N/A  
Test Suite duration: N/A  
Go: NfcWritableNdefBufferChangeTests_ or Back

nfc_NfcWritableNdefNightlyTests__52840r2_tgt_gcc_nfct2_71f9__0336cc8a
52840r2_tgt_gcc_nfct2_71f9__0336cc8a
Test Case Result Duration [s]
All PASSED ERROR FAILED MISSED IGNORED NOT_EXECUTED
2 0 0 0 0 0 2
test_1_nfc_writable_ndef_message_0_url NOT_EXECUTED N/A  
test_1_nfc_writable_ndef_message_1_empty NOT_EXECUTED N/A  
Test Suite duration: N/A  
Go: NfcWritableNdefNightlyTests_ or Back

nfc_NfcWritableNdefNightlyTests__5340r1app_tgt_gcc_nfct2_6179__99f47a86
5340r1app_tgt_gcc_nfct2_6179__99f47a86
Test Case Result Duration [s]
All PASSED ERROR FAILED MISSED IGNORED NOT_EXECUTED
2 0 0 0 0 0 2
test_1_nfc_writable_ndef_message_0_url NOT_EXECUTED N/A  
test_1_nfc_writable_ndef_message_1_empty NOT_EXECUTED N/A  
Test Suite duration: N/A  
Go: NfcWritableNdefNightlyTests_ or Back

nfc_NfcWritableNdefNightlyTests__54l15app_tgt_gcc_nfct2_a53a__e51617bc
54l15app_tgt_gcc_nfct2_a53a__e51617bc
Test Case Result Duration [s]
All PASSED ERROR FAILED MISSED IGNORED NOT_EXECUTED
2 0 0 0 0 0 2
test_1_nfc_writable_ndef_message_0_url NOT_EXECUTED N/A  
test_1_nfc_writable_ndef_message_1_empty NOT_EXECUTED N/A  
Test Suite duration: N/A  
Go: NfcWritableNdefNightlyTests_ or Back

nfc_NfcWritableNdefTests__52840r2_tgt_gcc_nfct2_71f9__0336cc8a
52840r2_tgt_gcc_nfct2_71f9__0336cc8a
Test Case Result Duration [s]
All PASSED ERROR FAILED MISSED IGNORED NOT_EXECUTED
1 0 0 0 0 0 1
test_1_nfc_writable_ndef_message_0_special_characters NOT_EXECUTED N/A  
Test Suite duration: N/A  
Go: NfcWritableNdefTests_ or Back

nfc_NfcWritableNdefTests__5340r1app_tgt_gcc_nfct2_6179__99f47a86
5340r1app_tgt_gcc_nfct2_6179__99f47a86
Test Case Result Duration [s]
All PASSED ERROR FAILED MISSED IGNORED NOT_EXECUTED
1 1 0 0 0 0 0
test_1_nfc_writable_ndef_message_0_special_characters PASSED 42.63  
Test Suite duration: N/A  
Go: NfcWritableNdefTests_ or Back

nfc_NfcWritableNdefTests__54l15app_tgt_gcc_nfct2_a53a__e51617bc
54l15app_tgt_gcc_nfct2_a53a__e51617bc
Test Case Result Duration [s]
All PASSED ERROR FAILED MISSED IGNORED NOT_EXECUTED
1 1 0 0 0 0 0
test_1_nfc_writable_ndef_message_0_special_characters PASSED 35.70  
Test Suite duration: N/A  
Go: NfcWritableNdefTests_ or Back

nrf5340audio_mono_FuncMonoSmoketest_digi_h1_fwd_bis_debug_5340adk_tgt_none_4a53__cb0e5a44
5340adk_tgt_none_4a53__cb0e5a44
Test Case Result Duration [s]
All PASSED ERROR FAILED MISSED IGNORED NOT_EXECUTED
1 0 0 0 0 0 1
test_audio_rms_level NOT_EXECUTED N/A  
Test Suite duration: N/A  
Go: mono_FuncMonoSmoketest_digi_h1_fwd_bis_debug or Back

nrf5340audio_stereo_OncommitStereoTest_digi_fwd_cis_5340adk_tgt_none_4a53__5388a366
5340adk_tgt_none_4a53__5388a366
Test Case Result Duration [s]
All PASSED ERROR FAILED MISSED IGNORED NOT_EXECUTED
1 0 0 0 0 0 1
test_volume_control_short NOT_EXECUTED N/A  
Test Suite duration: N/A  
Go: stereo_OncommitStereoTest_digi_fwd_cis or Back

nrf_provisioning_TestLwm2mClientIntegration_1_9160r2ns_tgt_zephyr_8ff1
9160r2ns_tgt_zephyr_8ff1
Test Case Result Duration [s]
All PASSED ERROR FAILED MISSED IGNORED NOT_EXECUTED
1 1 0 0 0 0 0
test_authenticate_and_flash PASSED 121.85  
Test Suite duration: N/A  
Go: provisioning_TestLwm2mClientIntegration_1 or Back

nrf_provisioning_TestLwm2mClientIntegration_9160r2ns_tgt_zephyr_8ff1
9160r2ns_tgt_zephyr_8ff1
Test Case Result Duration [s]
All PASSED ERROR FAILED MISSED IGNORED NOT_EXECUTED
1 1 0 0 0 0 0
test_authenticate_and_flash PASSED 112.29  
Test Suite duration: N/A  
Go: provisioning_TestLwm2mClientIntegration or Back

nrf_provisioning_TestLwm2mOuluIntegration_1_9160r2ns_tgt_zephyr_8ff1
9160r2ns_tgt_zephyr_8ff1
Test Case Result Duration [s]
All PASSED ERROR FAILED MISSED IGNORED NOT_EXECUTED
5 5 0 0 0 0 0
test_0_common_lib PASSED 0.11  
test_1_influxdb_lib PASSED 0.04  
test_2_lwm2m_lib PASSED 0.00  
test_3_modem_lib PASSED 0.00  
test_4_nrfcloud_lib PASSED 0.12  
Test Suite duration: N/A  
Go: provisioning_TestLwm2mOuluIntegration_1 or Back

nrf_provisioning_TestLwm2mOuluIntegration_9160r2ns_tgt_zephyr_8ff1
9160r2ns_tgt_zephyr_8ff1
Test Case Result Duration [s]
All PASSED ERROR FAILED MISSED IGNORED NOT_EXECUTED
5 5 0 0 0 0 0
test_0_common_lib PASSED 0.11  
test_1_influxdb_lib PASSED 0.07  
test_2_lwm2m_lib PASSED 0.00  
test_3_modem_lib PASSED 0.00  
test_4_nrfcloud_lib PASSED 0.11  
Test Suite duration: N/A  
Go: provisioning_TestLwm2mOuluIntegration or Back

nrf_provisioning_TestSLMIntegration_NativeTLS_1_9160r2ns_tgt_zephyr_8ff1
9160r2ns_tgt_zephyr_8ff1
Test Case Result Duration [s]
All PASSED ERROR FAILED MISSED IGNORED NOT_EXECUTED
2 1 0 0 0 0 1
test_00_authenticate_and_flash PASSED 89.02  
test_01_offline_services_generic_at_commands NOT_EXECUTED N/A  
Test Suite duration: N/A  
Go: provisioning_TestSLMIntegration_NativeTLS_1 or Back

nrf_provisioning_TestSLMIntegration_NativeTLS_9160r2ns_tgt_zephyr_8ff1
9160r2ns_tgt_zephyr_8ff1
Test Case Result Duration [s]
All PASSED ERROR FAILED MISSED IGNORED NOT_EXECUTED
2 1 0 0 0 0 1
test_00_authenticate_and_flash PASSED 87.34  
test_01_offline_services_generic_at_commands NOT_EXECUTED N/A  
Test Suite duration: N/A  
Go: provisioning_TestSLMIntegration_NativeTLS or Back

nrf_provisioning_TestSLMIntegration_Normal_1_9160r2ns_tgt_zephyr_8ff1
9160r2ns_tgt_zephyr_8ff1
Test Case Result Duration [s]
All PASSED ERROR FAILED MISSED IGNORED NOT_EXECUTED
2 2 0 0 0 0 0
test_00_authenticate_and_flash PASSED 56.17  
test_01_offline_services_generic_at_commands PASSED 8.86  
Test Suite duration: N/A  
Go: provisioning_TestSLMIntegration_Normal_1 or Back

nrf_provisioning_TestSLMIntegration_Normal_9160r2ns_tgt_zephyr_8ff1
9160r2ns_tgt_zephyr_8ff1
Test Case Result Duration [s]
All PASSED ERROR FAILED MISSED IGNORED NOT_EXECUTED
2 2 0 0 0 0 0
test_00_authenticate_and_flash PASSED 59.12  
test_01_offline_services_generic_at_commands PASSED 6.45  
Test Suite duration: N/A  
Go: provisioning_TestSLMIntegration_Normal or Back

nrf_provisioning_TestSLMLWM2MCarrier_1_9160r2ns_tgt_zephyr_8ff1
9160r2ns_tgt_zephyr_8ff1
Test Case Result Duration [s]
All PASSED ERROR FAILED MISSED IGNORED NOT_EXECUTED
3 3 0 0 0 0 0
test_0_authenticate_and_flash PASSED 69.08  
test_1_lwm2m_carrier_library_setup PASSED 26.18  
test_2_lwm2m_carrier_library PASSED 9.54  
Test Suite duration: N/A  
Go: provisioning_TestSLMLWM2MCarrier_1 or Back

nrf_provisioning_TestSLMLWM2MCarrier_9160r2ns_tgt_zephyr_8ff1
9160r2ns_tgt_zephyr_8ff1
Test Case Result Duration [s]
All PASSED ERROR FAILED MISSED IGNORED NOT_EXECUTED
3 3 0 0 0 0 0
test_0_authenticate_and_flash PASSED 70.91  
test_1_lwm2m_carrier_library_setup PASSED 43.12  
test_2_lwm2m_carrier_library PASSED 6.78  
Test Suite duration: N/A  
Go: provisioning_TestSLMLWM2MCarrier or Back

nrf_provisioning_TestSLMQuitStr_default_1_9160r2ns_tgt_zephyr_8ff1
9160r2ns_tgt_zephyr_8ff1
Test Case Result Duration [s]
All PASSED ERROR FAILED MISSED IGNORED NOT_EXECUTED
1 1 0 0 0 0 0
test_0_authenticate_and_flash_uart PASSED 38.83  
Test Suite duration: N/A  
Go: provisioning_TestSLMQuitStr_default_1 or Back

nrf_provisioning_TestSLMQuitStr_default_9160r2ns_tgt_zephyr_8ff1
9160r2ns_tgt_zephyr_8ff1
Test Case Result Duration [s]
All PASSED ERROR FAILED MISSED IGNORED NOT_EXECUTED
1 1 0 0 0 0 0
test_0_authenticate_and_flash_uart PASSED 41.05  
Test Suite duration: N/A  
Go: provisioning_TestSLMQuitStr_default or Back

nrf_provisioning_TestSLMQuitStr_var1_1_9160r2ns_tgt_zephyr_8ff1
9160r2ns_tgt_zephyr_8ff1
Test Case Result Duration [s]
All PASSED ERROR FAILED MISSED IGNORED NOT_EXECUTED
1 1 0 0 0 0 0
test_0_authenticate_and_flash_uart PASSED 46.70  
Test Suite duration: N/A  
Go: provisioning_TestSLMQuitStr_var1_1 or Back

nrf_provisioning_TestSLMQuitStr_var1_9160r2ns_tgt_zephyr_8ff1
9160r2ns_tgt_zephyr_8ff1
Test Case Result Duration [s]
All PASSED ERROR FAILED MISSED IGNORED NOT_EXECUTED
1 1 0 0 0 0 0
test_0_authenticate_and_flash_uart PASSED 49.37  
Test Suite duration: N/A  
Go: provisioning_TestSLMQuitStr_var1 or Back

nrf_provisioning_TestSLMQuitStr_var2_1_9160r2ns_tgt_zephyr_8ff1
9160r2ns_tgt_zephyr_8ff1
Test Case Result Duration [s]
All PASSED ERROR FAILED MISSED IGNORED NOT_EXECUTED
1 1 0 0 0 0 0
test_0_authenticate_and_flash_uart PASSED 48.40  
Test Suite duration: N/A  
Go: provisioning_TestSLMQuitStr_var2_1 or Back

nrf_provisioning_TestSLMQuitStr_var2_9160r2ns_tgt_zephyr_8ff1
9160r2ns_tgt_zephyr_8ff1
Test Case Result Duration [s]
All PASSED ERROR FAILED MISSED IGNORED NOT_EXECUTED
1 1 0 0 0 0 0
test_0_authenticate_and_flash_uart PASSED 49.31  
Test Suite duration: N/A  
Go: provisioning_TestSLMQuitStr_var2 or Back

nrf_provisioning_TestSLMQuitStr_var3_1_9160r2ns_tgt_zephyr_8ff1
9160r2ns_tgt_zephyr_8ff1
Test Case Result Duration [s]
All PASSED ERROR FAILED MISSED IGNORED NOT_EXECUTED
1 1 0 0 0 0 0
test_0_authenticate_and_flash_uart PASSED 48.26  
Test Suite duration: N/A  
Go: provisioning_TestSLMQuitStr_var3_1 or Back

nrf_provisioning_TestSLMQuitStr_var3_9160r2ns_tgt_zephyr_8ff1
9160r2ns_tgt_zephyr_8ff1
Test Case Result Duration [s]
All PASSED ERROR FAILED MISSED IGNORED NOT_EXECUTED
1 1 0 0 0 0 0
test_0_authenticate_and_flash_uart PASSED 49.06  
Test Suite duration: N/A  
Go: provisioning_TestSLMQuitStr_var3 or Back

nrf_provisioning_TestSLMTransport_NativeTLS_1_9160r2ns_tgt_zephyr_8ff1
9160r2ns_tgt_zephyr_8ff1
Test Case Result Duration [s]
All PASSED ERROR FAILED MISSED IGNORED NOT_EXECUTED
1 1 0 0 0 0 0
test_00_00_authenticate_and_flash_transport PASSED 44.69  
Test Suite duration: N/A  
Go: provisioning_TestSLMTransport_NativeTLS_1 or Back

nrf_provisioning_TestSLMTransport_NativeTLS_9160r2ns_tgt_zephyr_8ff1
9160r2ns_tgt_zephyr_8ff1
Test Case Result Duration [s]
All PASSED ERROR FAILED MISSED IGNORED NOT_EXECUTED
1 1 0 0 0 0 0
test_00_00_authenticate_and_flash_transport PASSED 43.30  
Test Suite duration: N/A  
Go: provisioning_TestSLMTransport_NativeTLS or Back

nrf_provisioning_TestSLMTransport_Normal_1_9160r2ns_tgt_zephyr_8ff1
9160r2ns_tgt_zephyr_8ff1
Test Case Result Duration [s]
All PASSED ERROR FAILED MISSED IGNORED NOT_EXECUTED
1 1 0 0 0 0 0
test_00_00_authenticate_and_flash_transport PASSED 41.25  
Test Suite duration: N/A  
Go: provisioning_TestSLMTransport_Normal_1 or Back

nrf_provisioning_TestSLMTransport_Normal_9160r2ns_tgt_zephyr_8ff1
9160r2ns_tgt_zephyr_8ff1
Test Case Result Duration [s]
All PASSED ERROR FAILED MISSED IGNORED NOT_EXECUTED
1 1 0 0 0 0 0
test_00_00_authenticate_and_flash_transport PASSED 40.45  
Test Suite duration: N/A  
Go: provisioning_TestSLMTransport_Normal or Back

nrf_provisioning_TestSLMUart_1_9160r2ns_tgt_zephyr_8ff1
9160r2ns_tgt_zephyr_8ff1
Test Case Result Duration [s]
All PASSED ERROR FAILED MISSED IGNORED NOT_EXECUTED
4 4 0 0 0 0 0
test_0_authenticate_and_flash_uart PASSED 39.08  
test_1_1_uart_multiple_commands PASSED 0.20  
test_1_2_uart_multiple_long_commands PASSED 1.76  
test_1_3_uart_incorrect_at_strings PASSED 5.52  
Test Suite duration: N/A  
Go: provisioning_TestSLMUart_1 or Back

nrf_provisioning_TestSLMUart_9160r2ns_tgt_zephyr_8ff1
9160r2ns_tgt_zephyr_8ff1
Test Case Result Duration [s]
All PASSED ERROR FAILED MISSED IGNORED NOT_EXECUTED
4 4 0 0 0 0 0
test_0_authenticate_and_flash_uart PASSED 40.33  
test_1_1_uart_multiple_commands PASSED 0.21  
test_1_2_uart_multiple_long_commands PASSED 0.43  
test_1_3_uart_incorrect_at_strings PASSED 5.49  
Test Suite duration: N/A  
Go: provisioning_TestSLMUart or Back

nrf_provisioning_TestZephyrLwm2mClientOverlays_1_9160r2ns_tgt_zephyr_8ff1
9160r2ns_tgt_zephyr_8ff1
Test Case Result Duration [s]
All PASSED ERROR FAILED MISSED IGNORED NOT_EXECUTED
7 7 0 0 0 0 0
test_0_setup_device PASSED 31.90  
test_1_overlay_avsystem PASSED 103.58  
test_2_overlay_avsystem_bootstrap PASSED 158.79  
test_3_overlay_test_default PASSED 151.68  
test_4_overlay_avsystem_release PASSED 162.87  
test_5_overlay_object_interop PASSED 153.05  
test_6_overlay_core_interop PASSED 153.05  
Test Suite duration: N/A  
Go: provisioning_TestZephyrLwm2mClientOverlays_1 or Back

nrf_provisioning_TestZephyrLwm2mClientOverlays_9160r2ns_tgt_zephyr_8ff1
9160r2ns_tgt_zephyr_8ff1
Test Case Result Duration [s]
All PASSED ERROR FAILED MISSED IGNORED NOT_EXECUTED
7 7 0 0 0 0 0
test_0_setup_device PASSED 30.71  
test_1_overlay_avsystem PASSED 100.02  
test_2_overlay_avsystem_bootstrap PASSED 160.93  
test_3_overlay_test_default PASSED 155.49  
test_4_overlay_avsystem_release PASSED 161.16  
test_5_overlay_object_interop PASSED 156.51  
test_6_overlay_core_interop PASSED 156.80  
Test Suite duration: N/A  
Go: provisioning_TestZephyrLwm2mClientOverlays or Back

rpc_TestSuiteRPCEntropy_5340r1app_tgt_gcc_e3af__5340r1net_gcc_123e
5340r1app_tgt_gcc_e3af__5340r1net_gcc_123e
Test Case Result Duration [s]
All PASSED ERROR FAILED MISSED IGNORED NOT_EXECUTED
1 1 0 0 0 0 0
test_rpc_entropy_sanity_test PASSED 10.90  
Test Suite duration: N/A  
Go: TestSuiteRPCEntropy or Back

thingy91_TestAwsIotNatSim_t91_tgt_zephyr_5446
t91_tgt_zephyr_5446
Test Case Result Duration [s]
All PASSED ERROR FAILED MISSED IGNORED NOT_EXECUTED
4 4 0 0 0 0 0
test_check_connected PASSED 0.00  
test_check_errors PASSED 0.00  
test_cloud_data_shadow_get_evt PASSED 0.00  
test_cloud_data_shadow_update_request_count PASSED 0.00  
Test Suite duration: N/A  
Go: TestAwsIotNatSim or Back

thingy91_TestAzureIotNatSim_t91_tgt_zephyr_5446
t91_tgt_zephyr_5446
Test Case Result Duration [s]
All PASSED ERROR FAILED MISSED IGNORED NOT_EXECUTED
6 6 0 0 0 0 0
test_check_connected PASSED 0.00  
test_check_errors PASSED 0.00  
test_cloud_data_temp_evt PASSED 0.00  
test_cloud_data_timestamp PASSED 0.00  
test_cloud_data_twin_get_evt PASSED 0.00  
test_cloud_data_twin_patch_evt PASSED 0.00  
Test Suite duration: N/A  
Go: TestAzureIotNatSim or Back

thingy91_TestCoapClientSampleNatSim_t91_tgt_zephyr_5446
t91_tgt_zephyr_5446
Test Case Result Duration [s]
All PASSED ERROR FAILED MISSED IGNORED NOT_EXECUTED
1 1 0 0 0 0 0
test_coap_client_uart PASSED 0.00  
Test Suite duration: N/A  
Go: TestCoapClientSampleNatSim or Back

thingy91_TestDownloadClientNatSim_t91_tgt_zephyr_5446
t91_tgt_zephyr_5446
Test Case Result Duration [s]
All PASSED ERROR FAILED MISSED IGNORED NOT_EXECUTED
1 1 0 0 0 0 0
test_download_client_uart PASSED 0.00  
Test Suite duration: N/A  
Go: TestDownloadClientNatSim or Back

thingy91_TestHttpServerNatSim_t91_tgt_zephyr_5446
t91_tgt_zephyr_5446
Test Case Result Duration [s]
All PASSED ERROR FAILED MISSED IGNORED NOT_EXECUTED
2 2 0 0 0 0 0
test_httpserver_data PASSED 0.00  
test_httpserver_uart PASSED 0.00  
Test Suite duration: N/A  
Go: TestHttpServerNatSim or Back

thingy91_TestHttpsClientNatSim_t91_tgt_zephyr_5446
t91_tgt_zephyr_5446
Test Case Result Duration [s]
All PASSED ERROR FAILED MISSED IGNORED NOT_EXECUTED
1 1 0 0 0 0 0
test_https_client_uart PASSED 0.00  
Test Suite duration: N/A  
Go: TestHttpsClientNatSim or Back

thingy91_TestMqttClientSampleNatSim_t91_tgt_zephyr_5446
t91_tgt_zephyr_5446
Test Case Result Duration [s]
All PASSED ERROR FAILED MISSED IGNORED NOT_EXECUTED
2 2 0 0 0 0 0
test_mqtt_client_uart PASSED 0.00  
test_mqtt_sample_cloud_data PASSED 0.00  
Test Suite duration: N/A  
Go: TestMqttClientSampleNatSim or Back

thingy91_TestUDPSampleNatSim_t91_tgt_zephyr_5446
t91_tgt_zephyr_5446
Test Case Result Duration [s]
All PASSED ERROR FAILED MISSED IGNORED NOT_EXECUTED
2 2 0 0 0 0 0
test_udp_sample_cloud_data PASSED 0.00  
test_udp_sample_uart PASSED 0.00  
Test Suite duration: N/A  
Go: TestUDPSampleNatSim or Back

Nonfunctional Tests


nfc_NfcReliabilityBusySimulatorT2Tests__52840r2_tgt_gcc_nfct2_71f9__0336cc8a
52840r2_tgt_gcc_nfct2_71f9__0336cc8a
Test Case Result Duration [s]
All PASSED ERROR FAILED MISSED IGNORED NOT_EXECUTED
1 0 0 0 0 0 1
test_1_T2_reading_with_busy_simulator NOT_EXECUTED N/A  
Test Suite duration: N/A  
Go: NfcReliabilityBusySimulatorT2Tests_ or Back

nfc_NfcReliabilityBusySimulatorT2Tests__5340r1app_tgt_gcc_nfct2_6179__99f47a86
5340r1app_tgt_gcc_nfct2_6179__99f47a86
Test Case Result Duration [s]
All PASSED ERROR FAILED MISSED IGNORED NOT_EXECUTED
1 0 0 0 0 0 1
test_1_T2_reading_with_busy_simulator NOT_EXECUTED N/A  
Test Suite duration: N/A  
Go: NfcReliabilityBusySimulatorT2Tests_ or Back

nfc_NfcReliabilityBusySimulatorT2Tests__54l15app_tgt_gcc_nfct2_a53a__e51617bc
54l15app_tgt_gcc_nfct2_a53a__e51617bc
Test Case Result Duration [s]
All PASSED ERROR FAILED MISSED IGNORED NOT_EXECUTED
1 0 0 0 0 0 1
test_1_T2_reading_with_busy_simulator NOT_EXECUTED N/A  
Test Suite duration: N/A  
Go: NfcReliabilityBusySimulatorT2Tests_ or Back

nfc_NfcReliabilityBusySimulatorT4Tests__52840r2_tgt_gcc_nfct2_71f9__0336cc8a
52840r2_tgt_gcc_nfct2_71f9__0336cc8a
Test Case Result Duration [s]
All PASSED ERROR FAILED MISSED IGNORED NOT_EXECUTED
1 0 0 0 0 0 1
test_1_T4_reading_with_busy_simulator NOT_EXECUTED N/A  
Test Suite duration: N/A  
Go: NfcReliabilityBusySimulatorT4Tests_ or Back

nfc_NfcReliabilityBusySimulatorT4Tests__5340r1app_tgt_gcc_nfct2_6179__99f47a86
5340r1app_tgt_gcc_nfct2_6179__99f47a86
Test Case Result Duration [s]
All PASSED ERROR FAILED MISSED IGNORED NOT_EXECUTED
1 0 0 0 0 0 1
test_1_T4_reading_with_busy_simulator NOT_EXECUTED N/A  
Test Suite duration: N/A  
Go: NfcReliabilityBusySimulatorT4Tests_ or Back

nfc_NfcReliabilityBusySimulatorT4Tests__54l15app_tgt_gcc_nfct2_a53a__e51617bc
54l15app_tgt_gcc_nfct2_a53a__e51617bc
Test Case Result Duration [s]
All PASSED ERROR FAILED MISSED IGNORED NOT_EXECUTED
1 0 0 0 0 0 1
test_1_T4_reading_with_busy_simulator NOT_EXECUTED N/A  
Test Suite duration: N/A  
Go: NfcReliabilityBusySimulatorT4Tests_ or Back

nfc_NfcReliabilityTests__52840r2_tgt_gcc_nfct2_71f9__0336cc8a
52840r2_tgt_gcc_nfct2_71f9__0336cc8a
Test Case Result Duration [s]
All PASSED ERROR FAILED MISSED IGNORED NOT_EXECUTED
2 0 0 0 0 0 2
test_1_tag_reading NOT_EXECUTED N/A  
test_2_tag_read_with_fail NOT_EXECUTED N/A  
Test Suite duration: N/A  
Go: NfcReliabilityTests_ or Back

nfc_NfcReliabilityTests__5340r1app_tgt_gcc_nfct2_6179__99f47a86
5340r1app_tgt_gcc_nfct2_6179__99f47a86
Test Case Result Duration [s]
All PASSED ERROR FAILED MISSED IGNORED NOT_EXECUTED
2 0 0 0 0 0 2
test_1_tag_reading NOT_EXECUTED N/A  
test_2_tag_read_with_fail NOT_EXECUTED N/A  
Test Suite duration: N/A  
Go: NfcReliabilityTests_ or Back

nfc_NfcReliabilityTests__54l15app_tgt_gcc_nfct2_a53a__e51617bc
54l15app_tgt_gcc_nfct2_a53a__e51617bc
Test Case Result Duration [s]
All PASSED ERROR FAILED MISSED IGNORED NOT_EXECUTED
2 0 0 0 0 0 2
test_1_tag_reading NOT_EXECUTED N/A  
test_2_tag_read_with_fail NOT_EXECUTED N/A  
Test Suite duration: N/A  
Go: NfcReliabilityTests_ or Back

nfc_NfcReliabilityWriteTests__52840r2_tgt_gcc_nfct2_71f9__0336cc8a
52840r2_tgt_gcc_nfct2_71f9__0336cc8a
Test Case Result Duration [s]
All PASSED ERROR FAILED MISSED IGNORED NOT_EXECUTED
1 0 0 0 0 0 1
test_1_tag_read_write NOT_EXECUTED N/A  
Test Suite duration: N/A  
Go: NfcReliabilityWriteTests_ or Back

nfc_NfcReliabilityWriteTests__5340r1app_tgt_gcc_nfct2_6179__99f47a86
5340r1app_tgt_gcc_nfct2_6179__99f47a86
Test Case Result Duration [s]
All PASSED ERROR FAILED MISSED IGNORED NOT_EXECUTED
1 0 0 0 0 0 1
test_1_tag_read_write NOT_EXECUTED N/A  
Test Suite duration: N/A  
Go: NfcReliabilityWriteTests_ or Back

nfc_NfcReliabilityWriteTests__54l15app_tgt_gcc_nfct2_a53a__e51617bc
54l15app_tgt_gcc_nfct2_a53a__e51617bc
Test Case Result Duration [s]
All PASSED ERROR FAILED MISSED IGNORED NOT_EXECUTED
1 0 0 0 0 0 1
test_1_tag_read_write NOT_EXECUTED N/A  
Test Suite duration: N/A  
Go: NfcReliabilityWriteTests_ or Back


Test Configurations

IUT Test Configuration Variants (40)


IUTTestConfigVariant #1
52840r2_tgt_gcc_70a5__9a72d0af

DUT:

Testers (2):
attr_hash 9be4d4c2
attr_variant_name 52840r2_tgt_gcc_70a5__9a72d0af
dut.attr_kconfig_symbols
Go: Back
 

IUTTestConfigVariant #2
52840r2_tgt_gcc_nfct2_71f9__0336cc8a

DUT:

Testers (2):
attr_hash 5e717ede
attr_variant_name 52840r2_tgt_gcc_nfct2_71f9__0336cc8a
dut.attr_kconfig_symbols CONFIG_NFC_T2T_LIB_ENABLED=y, CONFIG_NRFXLIB_NFC=y
Go: Back
 

IUTTestConfigVariant #3
52840r2_tgt_gcc_sdc_f59b__b76774ee

DUT:

Testers (3):
attr_hash e0f22f09
attr_variant_name 52840r2_tgt_gcc_sdc_f59b__b76774ee
dut.attr_kconfig_symbols CONFIG_BT_LL_SOFTDEVICE=y
Go: Back
 

IUTTestConfigVariant #4
52840r3_tgt_gcc_ce4c__52840r3_gcc_cf1a

DUT:

Testers (1):
attr_hash 2e6024f5
attr_variant_name 52840r3_tgt_gcc_ce4c__52840r3_gcc_cf1a
dut.attr_kconfig_symbols
Go: Back
 

IUTTestConfigVariant #5
52840r3_tgt_gcc_sdc_7bad__52840r3_gcc_sdc_c6d0

DUT:

Testers (1):
attr_hash 6b084c9e
attr_variant_name 52840r3_tgt_gcc_sdc_7bad__52840r3_gcc_sdc_c6d0
dut.attr_kconfig_symbols CONFIG_BT_LL_SOFTDEVICE=y
Go: Back
 

IUTTestConfigVariant #6
52840r3_tgt_gcc_sdc_newlib_3c3f__52840r3_gcc_sdc_newlib_c8f9

DUT:

Testers (1):
attr_hash 87feaa00
attr_variant_name 52840r3_tgt_gcc_sdc_newlib_3c3f__52840r3_gcc_sdc_newlib_c8f9
dut.attr_kconfig_symbols CONFIG_BT_LL_SOFTDEVICE=y, CONFIG_NEWLIB_LIBC=y
Go: Back
 

IUTTestConfigVariant #7
52bsim_bsim_gcc_sdc_650b__52bsim_gcc_sdc_7251

DUT:

Testers (1):
attr_hash 71c354aa
attr_variant_name 52bsim_bsim_gcc_sdc_650b__52bsim_gcc_sdc_7251
dut.attr_kconfig_symbols CONFIG_BT_LL_SOFTDEVICE=y
Go: Back
 

IUTTestConfigVariant #8
5340_tgt_0beb__5340_7874

DUT:

Testers (1):
attr_hash 7ebf2baa
attr_variant_name 5340_tgt_0beb__5340_7874
dut.attr_kconfig_symbols
Go: Back
 

IUTTestConfigVariant #9
5340_tgt_2363__5340_f32b

DUT:

Testers (1):
attr_hash 9d951680
attr_variant_name 5340_tgt_2363__5340_f32b
dut.attr_kconfig_symbols
Go: Back
 

IUTTestConfigVariant #10
5340_tgt_bd10__5340_074d

DUT:

Testers (1):
attr_hash a645b798
attr_variant_name 5340_tgt_bd10__5340_074d
dut.attr_kconfig_symbols
Go: Back
 

IUTTestConfigVariant #11
5340_tgt_gcc_rpc_c27b__5340_gcc_sdc_c180

DUT:

Testers (1):
attr_hash 875de6a7
attr_variant_name 5340_tgt_gcc_rpc_c27b__5340_gcc_sdc_c180
dut.attr_kconfig_symbols CONFIG_BT_RPC_STACK=y
Go: Back
 

IUTTestConfigVariant #12
5340_tgt_gcc_sdc_cef5__2df0d355

DUT:

Testers (3):
attr_hash 82c9b3b4
attr_variant_name 5340_tgt_gcc_sdc_cef5__2df0d355
dut.attr_kconfig_symbols CONFIG_BT_LL_SOFTDEVICE=y
Go: Back
 

IUTTestConfigVariant #13
5340_tgt_gcc_sdc_cef5__52840r3_gcc_sdc_c6d0

DUT:

Testers (1):
attr_hash a51ebdc7
attr_variant_name 5340_tgt_gcc_sdc_cef5__52840r3_gcc_sdc_c6d0
dut.attr_kconfig_symbols CONFIG_BT_LL_SOFTDEVICE=y
Go: Back
 

IUTTestConfigVariant #14
5340adk_tgt_none_4a53__52840r3_none_366b

DUT:

Testers (1):
attr_hash 7c835bcc
attr_variant_name 5340adk_tgt_none_4a53__52840r3_none_366b
dut.attr_kconfig_symbols
Go: Back
 

IUTTestConfigVariant #15
5340adk_tgt_none_4a53__5388a366

DUT:

Testers (3):
attr_hash 1a764cd0
attr_variant_name 5340adk_tgt_none_4a53__5388a366
dut.attr_kconfig_symbols
Go: Back
 

IUTTestConfigVariant #16
5340adk_tgt_none_4a53__cb0e5a44

DUT:

Testers (2):
attr_hash ff72c025
attr_variant_name 5340adk_tgt_none_4a53__cb0e5a44
dut.attr_kconfig_symbols
Go: Back
 

IUTTestConfigVariant #17
5340adk_tgt_none_a46b__52840r3_none_366b

DUT:

Testers (1):
attr_hash 5487a58f
attr_variant_name 5340adk_tgt_none_a46b__52840r3_none_366b
dut.attr_kconfig_symbols
Go: Back
 

IUTTestConfigVariant #18
5340app_ns_tgt_gcc_sdc_43cc__52840r3_gcc_sdc_c6d0

DUT:

Testers (1):
attr_hash 8e6429ed
attr_variant_name 5340app_ns_tgt_gcc_sdc_43cc__52840r3_gcc_sdc_c6d0
dut.attr_kconfig_symbols CONFIG_BT_LL_SOFTDEVICE=y
Go: Back
 

IUTTestConfigVariant #19
5340app_ns_tgt_gcc_sdc_43cc__6a35b764

DUT:

Testers (3):
attr_hash 934c8c49
attr_variant_name 5340app_ns_tgt_gcc_sdc_43cc__6a35b764
dut.attr_kconfig_symbols CONFIG_BT_LL_SOFTDEVICE=y
Go: Back
 

IUTTestConfigVariant #20
5340r1app_ns_tgt_gcc_cc3xx_oberon_c236

DUT:

Testers (0):
attr_hash 4d883bf6
attr_variant_name 5340r1app_ns_tgt_gcc_cc3xx_oberon_c236
dut.attr_kconfig_symbols
Go: Back
 

IUTTestConfigVariant #21
5340r1app_tgt_gcc_cc3xx_legacy_bd64

DUT:

Testers (0):
attr_hash 7c7e6db3
attr_variant_name 5340r1app_tgt_gcc_cc3xx_legacy_bd64
dut.attr_kconfig_symbols
Go: Back
 

IUTTestConfigVariant #22
5340r1app_tgt_gcc_cc3xx_oberon_4bea

DUT:

Testers (0):
attr_hash d611ca2e
attr_variant_name 5340r1app_tgt_gcc_cc3xx_oberon_4bea
dut.attr_kconfig_symbols
Go: Back
 

IUTTestConfigVariant #23
5340r1app_tgt_gcc_e3af__5340r1net_gcc_123e

DUT:

Testers (1):
attr_hash 863ad873
attr_variant_name 5340r1app_tgt_gcc_e3af__5340r1net_gcc_123e
dut.attr_kconfig_symbols
Go: Back
 

IUTTestConfigVariant #24
5340r1app_tgt_gcc_nfct2_6179__99f47a86

DUT:

Testers (2):
attr_hash e1c4735b
attr_variant_name 5340r1app_tgt_gcc_nfct2_6179__99f47a86
dut.attr_kconfig_symbols CONFIG_NFC_T2T_LIB_ENABLED=y, CONFIG_NRFXLIB_NFC=y
Go: Back
 

IUTTestConfigVariant #25
54h20fp1_tgt_87e3__52840r3_gcc_sdc_e902

DUT:

Testers (1):
attr_hash 9c12bb67
attr_variant_name 54h20fp1_tgt_87e3__52840r3_gcc_sdc_e902
dut.attr_kconfig_symbols
Go: Back
 

IUTTestConfigVariant #26
54h20fp1_tgt_gcc_sdc_1f1b__52840r3_gcc_sdc_e902

DUT:

Testers (1):
attr_hash 2ae6633a
attr_variant_name 54h20fp1_tgt_gcc_sdc_1f1b__52840r3_gcc_sdc_e902
dut.attr_kconfig_symbols CONFIG_BT_LL_SOFTDEVICE=y
Go: Back
 

IUTTestConfigVariant #27
54l15app_ns_tgt_gcc_cracen_8e7d

DUT:

Testers (0):
attr_hash caa47c88
attr_variant_name 54l15app_ns_tgt_gcc_cracen_8e7d
dut.attr_kconfig_symbols
Go: Back
 

IUTTestConfigVariant #28
54l15app_tgt_gcc_0791__4f6efc41

DUT:

Testers (2):
attr_hash c06ca076
attr_variant_name 54l15app_tgt_gcc_0791__4f6efc41
dut.attr_kconfig_symbols
Go: Back
 

IUTTestConfigVariant #29
54l15app_tgt_gcc_cracen_6f87

DUT:

Testers (0):
attr_hash d5d377e7
attr_variant_name 54l15app_tgt_gcc_cracen_6f87
dut.attr_kconfig_symbols
Go: Back
 

IUTTestConfigVariant #30
54l15app_tgt_gcc_nfct2_a53a__e51617bc

DUT:

Testers (2):
attr_hash fd8382b6
attr_variant_name 54l15app_tgt_gcc_nfct2_a53a__e51617bc
dut.attr_kconfig_symbols CONFIG_NFC_T2T_LIB_ENABLED=y, CONFIG_NRFXLIB_NFC=y
Go: Back
 

IUTTestConfigVariant #31
54l15app_tgt_gcc_sdc_6f23__52840r3_gcc_sdc_c6d0

DUT:

Testers (1):
attr_hash 13acafc1
attr_variant_name 54l15app_tgt_gcc_sdc_6f23__52840r3_gcc_sdc_c6d0
dut.attr_kconfig_symbols CONFIG_BT_LL_SOFTDEVICE=y
Go: Back
 

IUTTestConfigVariant #32
54l15app_tgt_gcc_sdc_6f23__54l15app_gcc_sdc_6551

DUT:

Testers (1):
attr_hash 88d44ff1
attr_variant_name 54l15app_tgt_gcc_sdc_6f23__54l15app_gcc_sdc_6551
dut.attr_kconfig_symbols CONFIG_BT_LL_SOFTDEVICE=y
Go: Back
 

IUTTestConfigVariant #33
54l15app_tgt_gcc_sdc_6f23__c847677b

DUT:

Testers (3):
attr_hash d17b1e0c
attr_variant_name 54l15app_tgt_gcc_sdc_6f23__c847677b
dut.attr_kconfig_symbols CONFIG_BT_LL_SOFTDEVICE=y
Go: Back
 

IUTTestConfigVariant #34
54lm20a_dk_tgt_gcc_sdc_3589__52840r3_gcc_sdc_e902

DUT:

Testers (1):
attr_hash ceb37009
attr_variant_name 54lm20a_dk_tgt_gcc_sdc_3589__52840r3_gcc_sdc_e902
dut.attr_kconfig_symbols CONFIG_BT_LL_SOFTDEVICE=y
Go: Back
 

IUTTestConfigVariant #35
7002DK_tgt_none_280e__ASUS_RTAX88U_none_1cd6

DUT:

Testers (1):
attr_hash 026e0205
attr_variant_name 7002DK_tgt_none_280e__ASUS_RTAX88U_none_1cd6
dut.attr_kconfig_symbols
Go: Back
 

IUTTestConfigVariant #36
9160r2ns_tgt_gcc_f5a4

DUT:

Testers (0):
attr_hash 97868aa5
attr_variant_name 9160r2ns_tgt_gcc_f5a4
dut.attr_kconfig_symbols
Go: Back
 

IUTTestConfigVariant #37
9160r2ns_tgt_gcc_ltem_3005

DUT:

Testers (0):
attr_hash ea775af2
attr_variant_name 9160r2ns_tgt_gcc_ltem_3005
dut.attr_kconfig_symbols CONFIG_LTE_LINK_CONTROL=y, CONFIG_LTE_NETWORK_MODE_LTE_M=y
Go: Back
 

IUTTestConfigVariant #38
9160r2ns_tgt_zephyr_8ff1

DUT:

Testers (0):
attr_hash 42cf4d61
attr_variant_name 9160r2ns_tgt_zephyr_8ff1
dut.attr_kconfig_symbols
Go: Back
 

IUTTestConfigVariant #39
9161fns_tgt_gcc_dc93

DUT:

Testers (0):
attr_hash 49ecf1e0
attr_variant_name 9161fns_tgt_gcc_dc93
dut.attr_kconfig_symbols
Go: Back
 

IUTTestConfigVariant #40
t91_tgt_zephyr_5446

DUT:

Testers (0):
attr_hash a0256ff2
attr_variant_name t91_tgt_zephyr_5446
dut.attr_kconfig_symbols
Go: Back
 

DUT Configuration Variants (34)

52840r2_tgt_gcc_70a5ConfigVariantDUT #1
attr_variant_name 52840r2_tgt_gcc_70a5
Go: Back
 
52840r2_tgt_gcc_nfct2_71f9ConfigVariantDUT #2
attr_variant_name 52840r2_tgt_gcc_nfct2_71f9
Go: Back
 
52840r2_tgt_gcc_sdc_f59bConfigVariantDUT #3
attr_variant_name 52840r2_tgt_gcc_sdc_f59b
Go: Back
 
52840r3_tgt_gcc_ce4cConfigVariantDUT #4
attr_variant_name 52840r3_tgt_gcc_ce4c
Go: Back
 
52840r3_tgt_gcc_sdc_7badConfigVariantDUT #5
attr_variant_name 52840r3_tgt_gcc_sdc_7bad
Go: Back
 
52840r3_tgt_gcc_sdc_newlib_3c3fConfigVariantDUT #6
attr_variant_name 52840r3_tgt_gcc_sdc_newlib_3c3f
Go: Back
 
52bsim_bsim_gcc_sdc_650bConfigVariantDUT #7
attr_variant_name 52bsim_bsim_gcc_sdc_650b
Go: Back
 
5340_tgt_0bebConfigVariantDUT #8
attr_variant_name 5340_tgt_0beb
Subsystems
Go: Back
 
5340_tgt_2363ConfigVariantDUT #9
attr_variant_name 5340_tgt_2363
Subsystems
Go: Back
 
5340_tgt_bd10ConfigVariantDUT #10
attr_variant_name 5340_tgt_bd10
Subsystems
Go: Back
 
5340_tgt_gcc_rpc_c27bConfigVariantDUT #11
attr_variant_name 5340_tgt_gcc_rpc_c27b
Subsystems
Go: Back
 
5340_tgt_gcc_sdc_cef5ConfigVariantDUT #12
attr_variant_name 5340_tgt_gcc_sdc_cef5
Subsystems
Go: Back
 
5340adk_tgt_none_4a53ConfigVariantDUT #13
attr_variant_name 5340adk_tgt_none_4a53
Subsystems
Go: Back
 
5340adk_tgt_none_a46bConfigVariantDUT #14
attr_variant_name 5340adk_tgt_none_a46b
Subsystems
Go: Back
 
5340app_ns_tgt_gcc_sdc_43ccConfigVariantDUT #15
attr_variant_name 5340app_ns_tgt_gcc_sdc_43cc
Subsystems
Go: Back
 
5340r1app_ns_tgt_gcc_cc3xx_oberon_c236ConfigVariantDUT #16
attr_variant_name 5340r1app_ns_tgt_gcc_cc3xx_oberon_c236
Go: Back
 
5340r1app_tgt_gcc_cc3xx_legacy_bd64ConfigVariantDUT #17
attr_variant_name 5340r1app_tgt_gcc_cc3xx_legacy_bd64
Go: Back
 
5340r1app_tgt_gcc_cc3xx_oberon_4beaConfigVariantDUT #18
attr_variant_name 5340r1app_tgt_gcc_cc3xx_oberon_4bea
Go: Back
 
5340r1app_tgt_gcc_e3afConfigVariantDUT #19
attr_variant_name 5340r1app_tgt_gcc_e3af
Go: Back
 
5340r1app_tgt_gcc_nfct2_6179ConfigVariantDUT #20
attr_variant_name 5340r1app_tgt_gcc_nfct2_6179
Go: Back
 
54h20fp1_tgt_87e3ConfigVariantDUT #21
attr_variant_name 54h20fp1_tgt_87e3
Subsystems
Go: Back
 
54h20fp1_tgt_gcc_sdc_1f1bConfigVariantDUT #22
attr_variant_name 54h20fp1_tgt_gcc_sdc_1f1b
Subsystems
Go: Back
 
54l15app_ns_tgt_gcc_cracen_8e7dConfigVariantDUT #23
attr_variant_name 54l15app_ns_tgt_gcc_cracen_8e7d
Go: Back
 
54l15app_tgt_gcc_0791ConfigVariantDUT #24
attr_variant_name 54l15app_tgt_gcc_0791
Go: Back
 
54l15app_tgt_gcc_cracen_6f87ConfigVariantDUT #25
attr_variant_name 54l15app_tgt_gcc_cracen_6f87
Go: Back
 
54l15app_tgt_gcc_nfct2_a53aConfigVariantDUT #26
attr_variant_name 54l15app_tgt_gcc_nfct2_a53a
Go: Back
 
54l15app_tgt_gcc_sdc_6f23ConfigVariantDUT #27
attr_variant_name 54l15app_tgt_gcc_sdc_6f23
Go: Back
 
54lm20a_dk_tgt_gcc_sdc_3589ConfigVariantDUT #28
attr_variant_name 54lm20a_dk_tgt_gcc_sdc_3589
Go: Back
 
7002DK_tgt_none_280eConfigVariantDUT #29
attr_variant_name 7002DK_tgt_none_280e
Go: Back
 
9160r2ns_tgt_gcc_f5a4ConfigVariantDUT #30
attr_variant_name 9160r2ns_tgt_gcc_f5a4
Go: Back
 
9160r2ns_tgt_gcc_ltem_3005ConfigVariantDUT #31
attr_variant_name 9160r2ns_tgt_gcc_ltem_3005
Go: Back
 
9160r2ns_tgt_zephyr_8ff1ConfigVariantDUT #32
attr_variant_name 9160r2ns_tgt_zephyr_8ff1
Go: Back
 
9161fns_tgt_gcc_dc93ConfigVariantDUT #33
attr_variant_name 9161fns_tgt_gcc_dc93
Go: Back
 
t91_tgt_zephyr_5446ConfigVariantDUT #34
attr_variant_name t91_tgt_zephyr_5446
Go: Back
 

Tester Configuration Variants (21)

52840r2_gcc_sdc_46d2ConfigVariantTester #1
attr_variant_name 52840r2_gcc_sdc_46d2
Go: Back
 
52840r3_gcc_cf1aConfigVariantTester #2
attr_variant_name 52840r3_gcc_cf1a
Go: Back
 
52840r3_gcc_sdc_c6d0ConfigVariantTester #3
attr_variant_name 52840r3_gcc_sdc_c6d0
Go: Back
 
52840r3_gcc_sdc_e902ConfigVariantTester #4
attr_variant_name 52840r3_gcc_sdc_e902
Go: Back
 
52840r3_gcc_sdc_newlib_c8f9ConfigVariantTester #5
attr_variant_name 52840r3_gcc_sdc_newlib_c8f9
Go: Back
 
52840r3_none_366bConfigVariantTester #6
attr_variant_name 52840r3_none_366b
Go: Back
 
52bsim_gcc_sdc_7251ConfigVariantTester #7
attr_variant_name 52bsim_gcc_sdc_7251
Go: Back
 
5340_074dConfigVariantTester #8
attr_variant_name 5340_074d
Subsystems
Go: Back
 
5340_7874ConfigVariantTester #9
attr_variant_name 5340_7874
Subsystems
Go: Back
 
5340_f32bConfigVariantTester #10
attr_variant_name 5340_f32b
Subsystems
Go: Back
 
5340_gcc_sdc_c180ConfigVariantTester #11
attr_variant_name 5340_gcc_sdc_c180
Subsystems
Go: Back
 
5340adk_none_24a6ConfigVariantTester #12
attr_variant_name 5340adk_none_24a6
Subsystems
Go: Back
 
5340adk_none_f75cConfigVariantTester #13
attr_variant_name 5340adk_none_f75c
Subsystems
Go: Back
 
5340app_ns_gcc_sdc_97c4ConfigVariantTester #14
attr_variant_name 5340app_ns_gcc_sdc_97c4
Subsystems
Go: Back
 
5340r1net_gcc_123eConfigVariantTester #15
attr_variant_name 5340r1net_gcc_123e
Go: Back
 
54l15app_gcc_sdc_6551ConfigVariantTester #16
attr_variant_name 54l15app_gcc_sdc_6551
Go: Back
 
ASUS_RTAX88U_none_1cd6ConfigVariantTester #17
attr_variant_name ASUS_RTAX88U_none_1cd6
Go: Back
 
_gcc_561fConfigVariantTester #18
attr_variant_name _gcc_561f
Go: Back
 
_gcc_c787ConfigVariantTester #19
attr_variant_name _gcc_c787
Go: Back
 
io_adapter_gcc_09efConfigVariantTester #20
attr_variant_name io_adapter_gcc_09ef
Go: Back
 
io_adapter_gcc_af02ConfigVariantTester #21
attr_variant_name io_adapter_gcc_af02
Go: Back
 

Subsystem Configuration Variants (13)

5340adkapp_zephyr_5c2cConfigVariantSubsystem #1
attr_variant_name 5340adkapp_zephyr_5c2c
Go: Back
 
5340adkapp_zephyr_d12bConfigVariantSubsystem #2
attr_variant_name 5340adkapp_zephyr_d12b
Go: Back
 
5340adknet_none_b2ddConfigVariantSubsystem #3
attr_variant_name 5340adknet_none_b2dd
Go: Back
 
5340adknet_none_e2b8ConfigVariantSubsystem #4
attr_variant_name 5340adknet_none_e2b8
Go: Back
 
5340app_gcc_d979ConfigVariantSubsystem #5
attr_variant_name 5340app_gcc_d979
Go: Back
 
5340app_gcc_rpc_2f61ConfigVariantSubsystem #6
attr_variant_name 5340app_gcc_rpc_2f61
Go: Back
 
5340app_gcc_sdc_191fConfigVariantSubsystem #7
attr_variant_name 5340app_gcc_sdc_191f
Go: Back
 
5340app_gcc_sdc_newlib_9203ConfigVariantSubsystem #8
attr_variant_name 5340app_gcc_sdc_newlib_9203
Go: Back
 
5340app_ns_gcc_6fe0ConfigVariantSubsystem #9
attr_variant_name 5340app_ns_gcc_6fe0
Go: Back
 
5340net_gcc_3d69ConfigVariantSubsystem #10
attr_variant_name 5340net_gcc_3d69
Go: Back
 
54h20rad_gcc_548aConfigVariantSubsystem #11
attr_variant_name 54h20rad_gcc_548a
Go: Back
 
app_gcc_d3c9ConfigVariantSubsystem #12
attr_variant_name app_gcc_d3c9
Go: Back
 
rad_gcc_3b2eConfigVariantSubsystem #13
attr_variant_name rad_gcc_3b2e
Go: Back
 

Unstable Test Cases

Total Share
0    0.0%   

Parse Errors (to be fixed)

Total parse errors count: 2
  • [Results] The following test suite(s) from "nrfconnect_results_find_my_ptm.json": - fmn_SimpleSampleTest_5340app_tgt_gcc_b2fb__47b7db31 - fmn_NfcReadoutUnpairedTests_5340app_tgt_gcc_b2fb__47b7db31 - fmn_CoexistenceSampleTest_5340app_tgt_gcc_b2fb__47b7db31 - fmn_QualificationSampleTest_5340app_tgt_gcc_b2fb__47b7db31 cannot be found in Test Specification. Results cannot be added. Skipped.
  • [Results] The following test suite(s) from "nrfconnect_results_rpc_ptm.json": - rpc_TestSuiteRPC_5340r1app_tgt_gcc_e3af__5340r1net_gcc_123e cannot be found in Test Specification. Results cannot be added. Skipped.